CaLAThe 7.0
type: ConceptScheme
title: CaLAThe - Cadastre and Land Administration Thesaurus, version 7.0
description: The Thesaurus for the domain of Cadastre and Land Administration, CaLAThe, regards the surveying and mapping of land, more specifically the boundaries of land parcels and individually owned buildings and building parts (condominiums), as performed by the profession of surveyors. From a public point of view, the domain provides the administrative and technical base for taxation of land and buildings, and for land use planning; from a private point of view, the domain supports security in ownership and other land-related rights. CaLAThe lies partly within the technical domains of civil engineering and computer science, partly within social science domains, including law and public administration
description: The Cadastre and Land Administration Thesaurus, CaLAThe, is a controlled vocabulary, recorded at http://www.cadastralvocabulary.org. The initial 2011 version of CaLAThe was prepared based on terms and term relationships derived from DIS version of the ISO 19152:2012 Land Administration Domain Model (LADM). Moreover, it referred to existing thesauri, primarily the GEMET thesaurus, the AGROVOC thesaurus, and the STW Thesaurus for Economics. Terms rendering dynamic or temporal aspects of the domain were added in version 2, while version 3 was supplemented with terms from the OGC Land and Infrastructure Conceptual Model Standard (LandInfra). Version 4 added code lists names and values from both standards, specified within its own skos:ConceptScheme. The code list values refer to CaLAThe thesaurus terms when possible in a meaningful way. Version 5 started a multi-lingual itinerary by adding terms (skos:prefLabel) in Danish and Turkish, the native language of the authors. Version 6 presents new and revised definitions for CaLAThe concepts. Intensional definition (also known as the genus-differentia definition) method recommended by ISO 704:2009 ‘Terminology work - Principles and methods’ is applied in the preparation of definitions. Version 6 also improves multilingualism of CaLAThe by adding Malay terms. The present Version 7 addresses the lack of Common Law terms. The two legal systems: Common Law and Civil Law, are explicitly introduced and nearly 10 Common Law terms with definitions are added, while largely keeping the thesaurus structure unchanged. It further improves multilingualism of CaLAThe by adding Dutch terms. The code list part, version 2, is rendered in a file separate from CaLAThe version 6 and later. It includes code lists specified in the Land and Survey parts of OGC LandInfra. A skos:Collection statement, mentioned above, specify relations between the two skos:ConceptSchemes. The content of the present file may be queried by means of the SKOS Play facili…
creator: Erik Stubkjær
creator: Volkan Çağdaş
date: 2024-03-29
issued: 2024-01-20
has top concept: Party
has top concept: Law
has top concept: Information
has top concept: Land
has top concept: Activity
has top concept: Survey

2D
type: Concept
preferred label: 2B @tr
scope note: OGC LandInfra / InfraGML term
definition: Dimension type, cf. OGC LandInfra 7.10.6 SpatialUnit
change note: Established with version 4
in scheme: CaLAThe 7.0
broader: Dimension type

3D
type: Concept
preferred label: 3B @tr
scope note: OGC LandInfra / InfraGML term
definition: Dimension type, cf. OGC LandInfra 7.10.6 SpatialUnit
change note: Established with version 4
in scheme: CaLAThe 7.0
broader: Dimension type

Activity
type: Concept
preferred label: Aktivitet @da
preferred label: Aktivite @tr
preferred label: Aktiviti @ms
preferred label: Activiteit @nl
definition: A sequence of actions organized towards a specific goal.
change note: Established with version 2. Narrower ParcelEstablishment added with version 3. Survey with version 4. Definition changed with version 7.
in scheme: CaLAThe 7.0
alternative label: Transaction
alternative label: Registration
narrower: Exchange
narrower: Property formation
narrower: Transfer

Adjudication
type: Concept
preferred label: Skelforretning @da
preferred label: Hükmen sınır belirleme @tr
preferred label: Penentuan sah sempadan @ms
preferred label: - @nl
definition: A process whereby the ownership and rights in land are officially determined (Source: UN-Habitat and GLTN, 2020).
change note: Established with version 2 as Legal boundary determination. The preferred label is changed to Adjudication with version 7.
in scheme: CaLAThe 7.0
alternative label: Legal boundary determination
broader: Boundary survey and marking

Administrative unit
type: Concept
preferred label: Administrativ inddeling @da
preferred label: İdari birim @tr
preferred label: Unit pentadbiran @ms
preferred label: - @nl
scope note: GEMET term
definition: Unit of administration where a Member State has and/or exercises jurisdictional rights, for local, regional and national governance (Source: INSPIRE feature concept dictionary).
change note: Established with version 1. Edited with version 3 and 4. Definition is revised in version 5.
in scheme: CaLAThe 7.0
alternative label: Jurisdiction
alternative label: LA_SpatialUnitGroup
alternative label: Administrative division
broader: Land division
narrower: NUTS Region
narrower: Protected site
narrower: Site

Adverse possession
type: Concept
preferred label: Ejendomshævd @da
preferred label: Kazandırıcı zamanaşımı @tr
preferred label: Pendudukan bertentangan @ms
preferred label: - @nl
change note: Established with version 2.
in scheme: CaLAThe 7.0
broader: Ownership
related: Prescriptive acquisition

Aerial photograph
type: Concept
preferred label: Luftfoto @da
preferred label: Hava fotoğrafı @tr
preferred label: Foto udara @ms
preferred label: - @nl
scope note: GEMET term
definition: An image of the ground surface made on a light-sensitive material and taken at a high altitude from an aircraft, spacecraft or rocket (Source: GEMET).
change note: Established with version 1.
in scheme: CaLAThe 7.0
broader: Digital imagery

Amalgamation
type: Concept
preferred label: Sammenægning @da
preferred label: Birleştirme @tr
preferred label: Cantuman @ms
preferred label: - @nl
definition: Activity that combines two or more neighbouring Cadastral parcels.
change note: Established with version 2.
in scheme: CaLAThe 7.0
related match: c 2793
broader: Property formation

Angle observation
type: Concept
preferred label: Vinkelobservation @da
preferred label: Açı gözlemi @tr
preferred label: Sudut pemerhatian @ms
preferred label: Hoekmeting @nl
change note: Established with version 4
in scheme: CaLAThe 7.0
broader: Observation
broader: Theodolite

Association
type: Concept
preferred label: Forening @da
preferred label: Birlik @tr
preferred label: Persatuan @ms
preferred label: - @nl
scope note: GEMET term
definition: A body of persons associated for the regulation of a common economic activity by means of a special organization (Source: GEMET).
change note: Established with version 1.
in scheme: CaLAThe 7.0
broader: Organisation
narrower: Professional society

Bank
type: Concept
preferred label: Banka @tr
preferred label: - @nl
scope note: ISO LADM term
change note: Established with version 1.
in scheme: CaLAThe 7.0
broader: Corporation

BEString
type: Concept
preferred label: - @da
scope note: OGC LandInfra / InfraGML term
definition: A one-dimensional geometric string representation, limited to curves of type LineString; CircularString; CompoundCurve constructed from LineStrings, CircularStrings, and/or other CompoundCurves; or MultiCurve of any of the previously specified types. (LandInfra 7.10.7)
change note: Established with version 4
in scheme: CaLAThe 7.0
broader: Bounding element
narrower: String type
narrower: Line string

Boundary
type: Concept
preferred label: Grænse, Matrikelskel @da
preferred label: Sınır @tr
preferred label: Sempadan @ms
preferred label: Grens @nl
scope note: ISO LADM and OGC LandInfra / InfraGML term
definition: Set that represents the limit of an entity. Note 1 to entry: Boundary is most commonly used in the context of geometry, where the set is a collection of points or a collection of objects that represent those points. In other arenas, the term is used metaphorically to describe the transition between an entity and the rest of its domain of discourse (Source: OGC LandInfra 4.8.3, referring to ISO 19107:2003, 4.4; ISO 19152:2012 4.1.3).
change note: Established with version 2. Definition added with version 3. Fixed boundary and General boundary added as narrower concepts with version 7.
narrow match: Kadastrale grens
in scheme: CaLAThe 7.0
alternative label: LA_Boundary
broader: Land division
narrower: Boundary mark
narrower: Fixed boundary
narrower: General boundary

Boundary mark
type: Concept
preferred label: Skelmærke, Grænsesten @da
preferred label: Sınır işareti @tr
preferred label: Tanda sempadan @ms
preferred label: - @nl
definition: Physical object which by its form defines a point on the surface of the Earth, which is stably located, and which is recorded in a statement. It may carry a symbol of authority, which communicates its purpose, e.g. marking of the legal boundary between two Land parcels according to jurisdiction-specific provisions (Source: OGC LandInfra, 4.8.16; 7.10.5.1).
change note: Established with version 1. Definition with version 3.
in scheme: CaLAThe 7.0
alternative label: Boundary monument
broader: Boundary
broader: Survey mark
related: Cadastral parcel

Boundary point
type: Concept
preferred label: Skelpunkt @da
preferred label: Sınır noktası @tr
preferred label: Titik sempadan @ms
preferred label: - @nl
definition: A BEPoint of a SpatialUnit, which provides shape and location to a LandParcel (OGC LandInfra 7.10.7)
change note: Established with version 7.
in scheme: CaLAThe 7.0
broader: Target point

Boundary re-measurement
type: Concept
preferred label: Teknisk ændring @da
preferred label: Tescile tabi teknik işlemler @tr
preferred label: Pengukuran semula sempadan @ms
preferred label: - @nl
definition: Activity which re-establish existing Boundary according to documented location. - Boundary re-measurement presupposes that the location of boundaries concerned is well documented.
change note: Established with version 2.
in scheme: CaLAThe 7.0
broader: Boundary survey and marking

Boundary rectification
type: Concept
preferred label: Ejendomsberigtigelse @da
preferred label: Sınır düzeltmesi @tr
preferred label: Pembetulan sempadan @ms
preferred label: Redres @nl
definition: A Boundary survey and marking conducted for correcting errors in the determined positions of Boundaries.
change note: Established with version 2.
narrow match: RedresPerceel
in scheme: CaLAThe 7.0
broader: Boundary survey and marking

Boundary survey and marking
type: Concept
preferred label: Afmærkning og indmåling af ske @da
preferred label: Sınırlandırma ve ölçme @tr
preferred label: Penandaan dan pengukuran sempa @ms
preferred label: - @nl
definition: An Activity of placing and surveying Boundary marks representing the location of a Boundary of a Cadastral parcel, and documenting the Activity.
change note: Established with version 2.0. Narrower added in version 3.
in scheme: CaLAThe 7.0
broader: Subdivision
narrower: Boundary rectification
narrower: Boundary re-measurement
narrower: Survey monument establishment
narrower: Adjudication

Bounding element
type: Concept
preferred label: Begrænsende element @da
preferred label: Sınırlandırıcı eleman @tr
preferred label: Unsur pembatasan @ms
preferred label: - @nl
scope note: OGC LandInfra / InfraGML term
definition: A Bounding element describe or define all or part of the geometry and location of the a Spatial unit (OGC LandInfra, 7.10.7).
change note: Established with version 3.
in scheme: CaLAThe 7.0
broader: Spatial unit
narrower: BEString
narrower: LA_BoundaryFaceString

Building use part
type: Concept
preferred label: Ejerlejlighedslod @da
preferred label: Bina kullanım bölümü @tr
preferred label: Bahagian guna bangunan @ms
preferred label: - @nl
scope note: OGC LandInfra / InfraGML term
definition: Part of a floor of a multi-storage building, subdivided according to management and use by a lawful process (Source: OGC LandInfra, 4.8.2; Compares to ISO 19152:2012 4.1.6 building unit, and to Ifc 5.4.3.51 SpatialZone).
change note: Established with version 1. Definition added with version 3.
in scheme: CaLAThe 7.0
alternative label: Building part
broader: Condominium
broader: Condominium building

Buyer
type: Concept
preferred label: Køber @da
preferred label: Alıcı @tr
preferred label: Pembeli @ms
preferred label: - @nl
scope note: OGC LandInfra / InfraGML term
change note: Established with version 4
in scheme: CaLAThe 7.0
broader: Signatory

Cadastral account
type: Concept
preferred label: Skematisk redegørelse @da
preferred label: Tescil bildirimi @tr
preferred label: Akaun kadaster @ms
preferred label: - @nl
scope note: OGC LandInfra / InfraGML term
definition: Land surveyors account of parcel and boundary changes, with references to pertinent legislation, intended for recording body (land administration agency, cadastral authority) (Source: OGC LandInfra, 7.10.4.1).
change note: Established with version 3.
related match: RelaasVanBevindingen
in scheme: CaLAThe 7.0
broader: Document

Cadastral map
type: Concept
preferred label: Matrikelkort @da
preferred label: Kadastral harita @tr
preferred label: Peta kadaster @ms
preferred label: - @nl
scope note: UNECE WPLA Guidelines
definition: A map showing land (cadastral) parcel boundaries. Cadastral maps may also show buildings. (Source: UNECE, 2004).
change note: Established with version 1. Definition and matches edited with verson 6
in scheme: CaLAThe 7.0
broader: Map
broader: Cadastre

Cadastral parcel
type: Concept
preferred label: Jordstykke, lod @da
preferred label: Kadastral parsel @tr
preferred label: Petak kadaster @ms
preferred label: - @nl
scope note: INSPIRE theme
definition: Contiguous part of the surface of the Earth, as specified through lawful process (Source: OGC LandInfra / InfraGML, 4.8.11).
change note: Established with version 1. Definition and Land parcel alternative term with version 3.
in scheme: CaLAThe 7.0
alternative label: Land parcel
alternative label: Parcel
broader: Real property
narrower: Carrier parcel
narrower: Main Parcel
related: Boundary mark

Cadastral survey
type: Concept
preferred label: Matrikuær måling @da
preferred label: Kadastral ölçme @tr
preferred label: Pengukuran kadaster @ms
preferred label: - @nl
definition: A survey that determines the ownership, boundaries, and location of a parcel of land (Source: Bruce, 1998).
change note: Added with version 7.
in scheme: CaLAThe 7.0
alternative label: Land survey
broader: Survey purpose

Cadastral survey document
type: Concept
preferred label: Måleblad @da
preferred label: Ölçü krokisi @tr
preferred label: Dokumen ukur kadaster @ms
definition: Land surveyors account of changes, with references to pertinent legislation, intended for recording body (land administration agency, cadastral authority) (Motivated by OGC LandInfra / InfraGML 7.10.4.1).
change note: Established with version 1. Definition added in version 3.
in scheme: CaLAThe 7.0
broader: Document
related: Registrar
related: Cadastre

Cadastral system
type: Concept
preferred label: Matrikel-og tinglysningssystem @da
preferred label: Kadastral sistem @tr
preferred label: Sistem kadaster @ms
preferred label: - @nl
definition: Combination of land registration and cadastre (Source: Adopted from https://doi.org/10.1016/S0198-9715(00)00051-X)
change note: Established with version 1. Relationships were edited with version 6.
in scheme: CaLAThe 7.0
broader: Geographic information system
narrower: Cadastre

Cadastre
type: Concept
preferred label: Matrikel, Matrikelregister @da
preferred label: Kadastro @tr
preferred label: Kadaster @ms
preferred label: - @nl
scope note: UNECE, WPLA: Guidelines, 2004. AGROVOC Multilingual Thesaurus term
definition: A parcel-based land information system that includes a geometric description of land parcels, usually represented on a cadastral map. In some jurisdictions it is considered separate from, but linked to, the register of land rights and holders of those rights (land registry), while in other jurisdictions the cadastre and land registry are fully integrated (Source: Adopted from FAO, 2002).
change note: Established with version 1. Definition, matches and relationships were edited with version 6. Definition changed with version 7.
in scheme: CaLAThe 7.0
alternative label: National survey and cadastre
broader: Cadastral system
broader: Registry
narrower: Cadastral map

Camera
type: Concept
preferred label: Kamera @da
preferred label: Fototoestel @nl
definition: An instrument composed of lens, shutter, and image sensor, used to capture and store digital images for aerial or terrestrial surveying purposes.
change note: Established with version 4. Definition added with version 7.
in scheme: CaLAThe 7.0
broader: Surveying instrument
narrower: Image
narrower: Digital imagery

Carrier parcel
type: Concept
preferred label: Reference-parcel @da
preferred label: Yüklü parsel @tr
preferred label: Petak pembawa @ms
preferred label: - @nl
scope note: OGC LandInfra / InfraGML term
definition: Land parcel on which a condominium building is located or which carries a superficies, that is a building or construction, established and owned by a person on land leased from another person (Source: OGC LandInfra, 7.10.2.4).
change note: Established with version 3.
in scheme: CaLAThe 7.0
broader: Cadastral parcel
related: Condominium building
related: Superficie object

Certificate
type: Concept
preferred label: Certifikat @da
preferred label: Sertifika @tr
preferred label: Sijil @ms
preferred label: - @nl
change note: Established with version 1.
in scheme: CaLAThe 7.0
broader: Document
narrower: Property enquiry certificate

Change of property unit type
type: Concept
preferred label: Ændring af ejendomstype @da
preferred label: Cins değişikliği @tr
preferred label: Perubahan jenis unit harta @ms
preferred label: Wijziging appartementsrechtsplitsing @nl
definition: An Activity leading to a change in the registered type of Real property.
change note: Established with version 2.
related match: Gebruiksdoel
in scheme: CaLAThe 7.0
broader: Property formation
narrower: Condominium subdivision

Chief
type: Concept
preferred label: Høvding @da
preferred label: Şef @tr
preferred label: Ketua @ms
preferred label: Stamhoofd @nl
scope note: ISO LADM term
definition: A Natural person who is the leader of a Social group, such as Tribe.
change note: Established with version 1. Definition is added with version 6.
in scheme: CaLAThe 7.0
broader: Societal role

Civil law
type: Concept
preferred label: Retssystemet Civilret @da
preferred label: Medeni Hukuk @tr
preferred label: Undang-undang sivil @ms
preferred label: - @nl
definition: Body of law developed from Roman law in continental Europe. The basis of law in civil-law jurisdictions is statute, not custom. Thus, in civil law, judges apply principles embodied in statutes, or law codes, rather than turning to case precedent (Source: https://www.britannica.com/summary/civil-law-Romano-Germanic. See also: http://www.juriglobe.ca/index.php).
change note: Added with version 7.
in scheme: CaLAThe 7.0
broader: Law
narrower: Land law

Co-ownership
type: Concept
preferred label: Sameje @da
preferred label: Paylı mülkiyet @tr
preferred label: Pemilikan bersama @ms
preferred label: Gezamenlijk eigendom @nl
definition: (1) Divided or undivided concurrent ownership exercised towards a property (Source: Legal Dictionary of Property in Canada - Dualjuridik). (2) Where two or more people own the same property (Source: EULIS / ELRA glossary). (3) Joint ownership by more than one legal person (Source: Bruce, 1998).
change note: Replaced to Shared ownership in version 3. Bruce (1998) definition added with version 7.
broad match: GezamenlijkAandeel
in scheme: CaLAThe 7.0
alternative label: Shared ownership
broader: Ownership
narrower: Condominium right
narrower: Timeshare right
narrower: Co-ownership share
narrower: Right of superficies

Co-ownership share
type: Concept
preferred label: Andel i fælleseje @da
preferred label: Ortak mülkiyet payı @tr
preferred label: Syer pemilikan bersama @ms
preferred label: Tenaamstelling aandeel @nl
change note: Established with version 3.
in scheme: CaLAThe 7.0
broader: Co-ownership
narrower: Party share
narrower: Condominium share

Code list
type: Concept
preferred label: Kodeliste @da
preferred label: Kod listesi @tr
preferred label: Senarai kod @ms
preferred label: - @nl
scope note: ISO 19136
definition: 1. Value domain including a code for each permissible value (Geolexica; ISO 19136-1:2020, (E), 3.1.7) 2. Complete set of data element values of a coded simple data element (ADMS Controlled Vocabularies ISO 9735-1:2002, 4.14) - A code list is identified by a name and comprises a set of values
change note: Added with version 5. Updated ISO reference and added exact match with version 6
in scheme: CaLAThe 7.0
broader: Information
narrower: User defined value

Collective ownership
type: Concept
preferred label: Ejendomsfællesskab @da
preferred label: Birlikte mülkiyet @tr
preferred label: Pemilikan kolektif @ms
preferred label: - @nl
change note: Established with version 3.
in scheme: CaLAThe 7.0
broader: Customary law

Common law
type: Concept
preferred label: Retssystemet Common law @da
preferred label: Ortak Hukuk; Anglosakson Hukuku @tr
preferred label: Undang-undang am; Undang-undang semua @ms
preferred label: - @nl
definition: Legal system used in Anglo-Saxon countries (United Kingdom, United States, Canada and Commonwealth countries in particular). This legal system is based on case law as the main source of law (Source: UN-Habitat and GLTN, 2020).
change note: Added with version 7.
in scheme: CaLAThe 7.0
broader: Law
narrower: Land tenure

Compass
type: Concept
preferred label: Kompas @da
preferred label: Pusula @tr
preferred label: - @nl
scope note: OGC LandInfra / InfraGML term
change note: Established with version 4. Label added with version 7.
in scheme: CaLAThe 7.0
broader: Surveying instrument

Condominium
type: Concept
preferred label: Ejerlejlighed, ej.hedskompleks @da
preferred label: Bağımsız bölüm @tr
preferred label: Kondominium @ms
preferred label: - @nl
scope note: OGC LandInfra / InfraGML term
definition: Concurrent ownership of real property that has been divided into private and common portions (Legal Dictionary of Property in Canada - Dualjuridik). Note 1 to entry: Condominium unit owners must be members of a mandatory owners association and engage in the maintenance of joint facilities according to a specified share (Source: OGC LandInfra, 4.8.4).
change note: Established with version 3.
in scheme: CaLAThe 7.0
alternative label: Condominium unit
broader: Real property
narrower: Building use part
related: Condominium right
related: Condominium scheme

Condominium acquisition
type: Concept
preferred label: Erhvervelse af ejerlejlighed @da
preferred label: Bağımsız bölüm edinimi @tr
preferred label: Pengambilan kondominium @ms
preferred label: - @nl
scope note: OGC LandInfra / InfraGML term
definition: Conveyance of a Condominium unit, where seller is either the Owner of the original Real property or the owner of a Condominium unit (Source: OGC LandInfra, 7.10.4.1).
change note: Established with version 3.
in scheme: CaLAThe 7.0
broader: Conveyance

Condominium building
type: Concept
preferred label: Bygning, opdelt i ejerlejlighe @da
preferred label: Kat mülkiyetine konu bina @tr
preferred label: Bangunan kondominium @ms
preferred label: - @nl
scope note: OGC LandInfra / InfraGML term
definition: A Building containing Condominium units subject to a single CondominiumScheme (Source: OGC LandInfra, 7.11.3).
change note: Established with version 3.
in scheme: CaLAThe 7.0
broader: Construction
narrower: Building use part
narrower: LA_LegalSpaceBuildingUnit
related: Carrier parcel

Condominium right
type: Concept
preferred label: Ejerlejlighedsadkomst @da
preferred label: Kat mülkiyeti @tr
preferred label: Hak kondominium @ms
preferred label: - @nl
definition: Type of co-ownership right.
change note: Established with version 1, changed and defined with version 3.
in scheme: CaLAThe 7.0
alternative label: Apartment ownership
broader: Co-ownership
related: Condominium

Condominium scheme
type: Concept
preferred label: Ejerlejlighedsfortegnelse mv @da
preferred label: Bağımsız bölüm listesi @tr
preferred label: Skim kondominium @ms
preferred label: - @nl
scope note: OGC LandInfra / InfraGML term
definition: Documentation of interest in land in terms of a statement concerning the building parts which make up a number of condominium units and the share of joint facilities of each condominium unit (Source: OGC LandInfra, 4.8.5).
change note: Established with version 3.
in scheme: CaLAThe 7.0
broader: Document

Condominium share
type: Concept
preferred label: Fordelingstal @da
preferred label: Arsa payı @tr
preferred label: Syer kondominium @ms
preferred label: - @nl
change note: Established with version 3.
in scheme: CaLAThe 7.0
broader: Co-ownership share

Condominium subdivision
type: Concept
preferred label: Opdeling i ejerlejligheder @da
preferred label: Bağımsız bölüm ifrazı @tr
preferred label: Pecah bahagi kondominium @ms
preferred label: - @nl
scope note: OGC LandInfra / InfraGML term
definition: A Subdivision of a multi-storage building into ownership units through a Condominium scheme, which for each unit specifies one or more Building use parts and a Co-ownership share in the joint facilities (Source: OGC LandInfra, 7.10.4.1).
change note: Established with version 2. Definition added with version 3.
in scheme: CaLAThe 7.0
broader: Subdivision
broader: Change of property unit type

Construction
type: Concept
preferred label: Teknisk anæg @da
preferred label: Yapı @tr
preferred label: Pembinaan @ms
preferred label: - @nl
scope note: OGC LandInfra / InfraGML term
definition: Assembled or complete part of construction works that results from work on-site [ISO 6707-1:2014] (Source: OGC LandInfra, 4.2.4).
change note: Established with version 3.
in scheme: CaLAThe 7.0
alternative label: Building
broader: Topographical feature
narrower: Condominium building
narrower: Superficie object

Control point
type: Concept
preferred label: Punkt, der er afmærket og stedbestemt ved koordinater @da
preferred label: Kontrol noktası @tr
preferred label: Titik kawalan @ms
preferred label: - @nl
definition: An accurately surveyed coordinate location for a physical feature that can be identified on the ground. (Source: ESRI GIS dictionary)
change note: Established with version 7.
in scheme: CaLAThe 7.0
broader: Target point
related: Control point monument

Control point monument
type: Concept
preferred label: Fikspunktmærke @da
preferred label: Kontrol noktası tesisi @tr
preferred label: Monumen titik kawalan @ms
preferred label: Geodetisch monument @nl
change note: Established with version 1.
related match: global class Referentiepunten GeodetischMonument
in scheme: CaLAThe 7.0
alternative label: Survey monument
broader: Survey mark
related: Control point

Conveyance
type: Concept
preferred label: Overdragelse @da
preferred label: Devir @tr
preferred label: Pemindahhakkan @ms
preferred label: - @nl
definition: An Exchange of Ownership between a Buyer and Seller.
change note: Established with version 2.
in scheme: CaLAThe 7.0
alternative label: Sale
alternative label: Purchase
broader: Exchange
narrower: Condominium acquisition
narrower: Parcel acquisition

Coordinate
type: Concept
preferred label: Koordinat @da
preferred label: - @nl
definition: One of a sequence of numbers designating the position of a point. Note to entry: In a coordinate reference system, the coordinate numbers are qualified by units. (Geolexica, ISO 19111:2019, (E), 3.1.5)
change note: Established with version 4
in scheme: CaLAThe 7.0
broader: Coordinate reference system

Coordinate reference system
type: Concept
preferred label: Koordinatreferencesystem @da
preferred label: Koordinat referans sistemi @tr
preferred label: Sistem rujukan koordinat @ms
preferred label: - @nl
scope note: INSPIRE term
definition: 1) Systems for uniquely referencing spatial information in space as a set of coordinates (x, y, z) and/or latitude and longitude and height, based on a geodetic horizontal and vertical datum (Source: INSPIRE glossary). 2) Coordinate system that is related to an object by a datum (Source: ISO 19111:2019, (E), 3.1.9).
change note: Established with version 1.
in scheme: CaLAThe 7.0
broader: Spatial reference
narrower: Coordinate
narrower: Datum
narrower: Coordinate tuple

Coordinate tuple
type: Concept
preferred label: Koordinat tupel @da
preferred label: Koordinat üçlüsü @tr
preferred label: Tupel koordinat @ms
preferred label: Coordinaat gegevens @nl
scope note: ISO 19111,Geolexica term
definition: Tuple composed of coordinates. Note: The number of coordinates in the coordinate tuple equals the dimension of the coordinate system; the order of coordinates in the coordinate tuple is identical to the order of the axes of the coordinate system. (ISO 19111:2019, (E), 3.1.13)
change note: Established with version 4
in scheme: CaLAThe 7.0
broader: Coordinate reference system

Corporation
type: Concept
preferred label: Virksomhed, aktieselskab @da
preferred label: İşletme @tr
preferred label: Perbadanan @ms
preferred label: - @nl
scope note: STW Thesaurus for Economics term
change note: Established with version 1.
in scheme: CaLAThe 7.0
broader: Organisation
narrower: Bank

Correction
type: Concept
preferred label: Korrektion @da
preferred label: Düzeltme @tr
preferred label: Pembetulan @ms
preferred label: Correctie @nl
scope note: OGC LandInfra / InfraGML term
definition: Compensation applied to the raw measurements from a survey instrument (sensor) (cf. OGC LandInfra 7.8.5.15 ObservationCorrections)
change note: Established with version 4
in scheme: CaLAThe 7.0
broader: Observation

Curve
type: Concept
preferred label: Kurve @da
preferred label: Eğri @tr
preferred label: Garisan @ms
preferred label: - @nl
scope note: Geolexica term
definition: 1-dimensional geometric primitive, representing the continuous image of a line. Note to entry: The boundary of a curve is the set of points at either end of the curve. If the curve is a cycle, the two ends are identical, and the curve (if topologically closed) is considered to not have a boundary. The first point is called the start point, and the last is the end point. Connectivity of the curve is guaranteed by the "continuous image of a line" clause. A topological theorem states that a continuous image of a connected set is connected. (Geolexica ISO 19136-1:2020)
change note: Established with version 4
in scheme: CaLAThe 7.0
broader: Geometric primitive
broader: Polygon
narrower: Line string

Customary law
type: Concept
preferred label: Sædvaneret @da
preferred label: Geleneksel hukuk @tr
preferred label: Undang-undang adat @ms
preferred label: Gewoonterecht @nl
change note: Established with version 1. Custom made preferred term with version 3. Alternative labels of Informal right and Indigenous right deleted with version 7.
in scheme: CaLAThe 7.0
alternative label: Custom
broader: Law
narrower: Collective ownership
narrower: Customary tenure

Customary tenure
type: Concept
preferred label: Sædvaneretlig ejendomsbesiddelse @da
preferred label: Geleneksel arazi rejimi @tr
preferred label: Pemilikan adat @ms
preferred label: - @nl
scope note: FAO (2002) concept
definition: Tenure of indigenous communities, administered in accordance with their customs. Some African countries may have given legal status to customary tenure. It often includes communal rights to pastures and exclusive private rights to agricultural and residential parcels.
change note: Added with version 7.
in scheme: CaLAThe 7.0
broader: Customary law
broader: Land tenure
narrower: Indigenous tenure system

Datum
type: Concept
preferred label: Datum, Data tunggal @ms
scope note: Geolexica term
definition: Parameter or set of parameters that realize the position of the origin, the scale, and the orientation of a coordinate system (Geolexica; ISO 19111:2019, (E), 3.1.15)
change note: Established with version 4
in scheme: CaLAThe 7.0
broader: Coordinate reference system

Deed
type: Concept
preferred label: Beseglet dokument, skøde @da
preferred label: Sözleşme @tr
preferred label: Surat ikatan @ms
preferred label: - @nl
scope note: Established with version 1.
in scheme: CaLAThe 7.0
broader: Document
narrower: Mortgage deed
narrower: Title deed
narrower: Restriction deed

Design point
type: Concept
preferred label: Punkt i teknisk anlæg (der skal afsættes) @da
preferred label: Plandaki nokta (aplike edilecek) @tr
preferred label: Titik reka bentuk @ms
preferred label: Terreinpunt @nl
scope note: OGC LandInfra / InfraGML term
definition: The point geometry [of a construction] to be staked out (cf. OGC LandInfra 7.8.7.4 and .5).
change note: Established with version 4. Relationships changed with version 7.
in scheme: CaLAThe 7.0
broader: Survey point

Digital imagery
type: Concept
preferred label: Digitalt billedmateriale @da
preferred label: Sayısal görüntü @tr
preferred label: Imej digital, Pengimejan digi @ms
preferred label: - @nl
definition: Raster graphics image
change note: Established with version 1. Edited with version 4.
in scheme: CaLAThe 7.0
narrow match: https://isotc211.geolexica.org/concepts/860/
related match: c_9000033
broader: Geolocated information
broader: Camera
narrower: Satellite image
narrower: Aerial photograph
narrower: Orthoimagery

Dimension type
type: Concept
preferred label: Dimensionstype @da
preferred label: Boyut türü @tr
preferred label: Jenis dimensi, Jenis ukuran @ms
preferred label: - @nl
scope note: OGC LandInfra / InfraGML term
change note: Established with version 4
in scheme: CaLAThe 7.0
broader: Spatial unit
narrower: 2D
narrower: 3D
narrower: Liminal

Distance observation
type: Concept
preferred label: Afstandsobservation @da
preferred label: Mesafe gözlemi @tr
preferred label: Jarak pemerhatian, Jarak cerap @ms
preferred label: Afstandmeting @nl
scope note: OGC LandInfra / InfraGML term
definition: A DistanceObservation contains horizontal / vertical or slope distance from the InstrumentPoint to the TargetPoint. (Source: OGC LandInfra 7.8.3.6)
change note: Established with version 4. Definition added with version 7.
in scheme: CaLAThe 7.0
broader: Observation
broader: Measuring tape
broader: Electronic distance meter

Document
type: Concept
preferred label: Dokument @da
preferred label: Belge @tr
preferred label: Dokumen @ms
preferred label: Informatieobject @nl
scope note: GEMET term
definition: Material of any kind, regardless of physical form, which furnishes information, evidence or ideas, including items such as contracts, bills of sale, letters, audio and video recordings, and machine readable data files (Source: GEMET). Information in permanent form which is approved by one or more signatures (Source: OGC LandInfra, 4.1.7, Compares to ISO 19152:2012 4.1.21 source)
change note: Established with version 1. Definition edited and alternative term added with version 3.
in scheme: CaLAThe 7.0
alternative label: Statement
broader: Information
narrower: Cadastral survey document
narrower: Certificate
narrower: Condominium scheme
narrower: Superficie object scheme
narrower: Easement deed
narrower: Cadastral account
narrower: LA_Source
narrower: Deed
related: Draftsman

Dominant property unit
type: Concept
preferred label: Herskende ejendom @da
preferred label: Hakim taşınmaz @tr
preferred label: Unit harta dominan @ms
preferred label: - @nl
definition: Land (Property unit) for which a servitude is granted (Source: Legal Dictionary of Property in Canada - Dualjuridik).
change note: Established with version 3.
in scheme: CaLAThe 7.0
broader: Easement

Draftsman
type: Concept
preferred label: Koncipist @da
preferred label: - @tr
preferred label: Perangka @ms
scope note: OGC LandInfra / InfraGML term
definition: A Professional who prepares or drafts Documents.
change note: Established as Draftsman in version 3, revised as Drafter in version 5, and changed again as Draftsman in version 6. Definition is added with version 6.
in scheme: CaLAThe 7.0
broader: Professional
related: Document

Easement
type: Concept
preferred label: Servitut @da
preferred label: İrtifak hakkı @tr
preferred label: Esmen @ms
preferred label: - @nl
scope note: GEMET term. Compares to ISO LADM 4.1.19 restriction
definition: The rights of use over the property of another; a burden on a piece of land causing the owner to suffer access by another (Source: GEMET). Accessory interest in land which advantages dominant land or other beneficiary (Source: Legal Dictionary of Property in Canada - Dualjuridik; cf. OGC LandInfra, 4.8.6).
change note: Established with version 1. Changed with version 3.
in scheme: CaLAThe 7.0
broader: Encumbrance
narrower: Private law restriction
narrower: Servient property unit
narrower: Public law restriction
narrower: Dominant property unit

Easement creation
type: Concept
preferred label: Stiftelse af servitut @da
preferred label: İrtifak hakkı tesisi @tr
preferred label: Penciptaan esmen @ms
preferred label: Vestiging erfdienstbaarheid @nl
definition: An Activity that establishes a nonpossessory right to use and/or enter onto the Real property of another without possessing.
change note: Established with version 2. Scope note and relations added with version 3.
related match: Erfdienstbaarheid
in scheme: CaLAThe 7.0
broader: Exchange
related: Dominant property unit
related: Servient property unit
related: Condominium scheme

Easement deed
type: Concept
preferred label: Deklaration, Servitutdokument @da
preferred label: İrtifak hakkı sözleşmesi @tr
preferred label: Surat ikatan esmen @ms
preferred label: Akte waarin erfidienstbaarheid staat vermeld @nl
scope note: OGC LandInfra / InfraGML term
change note: Established with version 3 as Easement scheme, and changed as Easement deed in version 5.
in scheme: CaLAThe 7.0
broader: Document

Edge
type: Concept
preferred label: Kant @da
preferred label: Kenar @tr
preferred label: Pinggir, Hujung @ms
preferred label: - @nl
scope note: Geolexica term
definition: 1-dimensional topological primitive. Note to entry: The geometric realization of an edge is a curve. The boundary of an edge is the set of one or two nodes associated to the edge within a topological complex. (Geolexica, ISO 19107:2003)
change note: Introduced with version 4
in scheme: CaLAThe 7.0
broader: Topological primitive
narrower: LA_Edge based spatial unit

Electronic distance meter
type: Concept
preferred label: Elektrooptisk afstandsmåler @da
preferred label: Elektronik uzunluk ölçer @tr
preferred label: Meter jarak elektronik @ms
preferred label: Elektronische afstandsmeter @nl
scope note: OGC LandInfra / InfraGML term
definition: Instrument for directly measuring distances between the instrument and the sighting points, comprising a transmitter and a receiver (OGC LandInfra 4.6.3, referring to ISO 9849-1:2000)
change note: Established with version 4
in scheme: CaLAThe 7.0
broader: Surveying instrument
narrower: Distance observation

Elevation
type: Concept
preferred label: Højde @da
preferred label: Yükseklik @tr
preferred label: Ketinggian @ms
preferred label: - @nl
scope note: INSPIRE term
definition: Height above sea level.
change note: Established with version 1. Definition is added in version 5.
in scheme: CaLAThe 7.0
broader: Topographical feature

Encumbrance
type: Concept
preferred label: Byrde, Begrænset ejendomsret @da
preferred label: Sınırlı ayni hak @tr
preferred label: Hak terhad @ms
preferred label: - @nl
definition: A burden or claim on a title such as a mortgage or easement. (State Government of Victoria: Glossary of Terms, Sept 2021)
change note: Established with version 3. With version 7 PrefLabel changed to Encumbrance, and Limited right changed to AltLabel, in order to apply the definition stated by State Government of Victoria: Glossary of Terms, Sept 2021.
in scheme: CaLAThe 7.0
alternative label: Limited right
broader: Real right
narrower: Usufruct
narrower: Easement
narrower: Security interest
narrower: LA_Restriction

Engineer
type: Concept
preferred label: Ingeniør @da
preferred label: Mühendis @tr
preferred label: Jurutera @ms
preferred label: Ingenieur @nl
definition: A Professional who is trained in a branch of engineering.
change note: Established with version 3. Definition is added with version 6.
in scheme: CaLAThe 7.0
broader: Professional

Exchange
type: Concept
preferred label: Ejendomsdispositioner @da
preferred label: Devir @tr
preferred label: Pertukaran @ms
preferred label: Uitwisseling @nl
definition: The disposal of Real property or Real rights on a value for value basis.
change note: Established with version 2.
in scheme: CaLAThe 7.0
broader: Activity
narrower: Conveyance
narrower: Lease
narrower: Rent
narrower: Mortgaging
narrower: Forced sale
narrower: Easement creation

Expropriation
type: Concept
preferred label: Ekspropriation @da
preferred label: Kamulaştırma @tr
preferred label: Perampasan, Pengambilalihan @ms
preferred label: - @nl
scope note: GEMET term
definition: The compulsory depriving of an Owner of Real property in return for compensation because of public interest.
change note: Established with version 2.
in scheme: CaLAThe 7.0
alternative label: Compulsory purchase
broader: Property restructuring

Face
type: Concept
preferred label: Flade @da
preferred label: Yüzey @tr
preferred label: Permukaan, Pandangan @ms
preferred label: - @nl
scope note: Geolexica term
definition: 2-dimensional topological primitive. Note to entry: The geometric realization of a face is a surface. The boundary of a face is the set of directed edges within the same topological complex that are associated to the face via the boundary relations. These can be organized as rings. (Geolexica, ISO 19107:2003)
change note: Introduced with version 4
in scheme: CaLAThe 7.0
broader: Topological primitive
narrower: LA_Face based spatial unit

Family
type: Concept
preferred label: Familie @da
preferred label: Aile @tr
preferred label: Keluarga @ms
scope note: GEMET term
definition: A group comprising parents, offsprings and others closely related or associated with them (Source: Lincoln, Boxshall and Clark, 1982).
change note: Established with version 1. Definition is revised with version 6.
in scheme: CaLAThe 7.0
broader: Social group

Farmer
type: Concept
preferred label: Landmand @da
preferred label: Çiftçi @tr
preferred label: Petani @ms
preferred label: Boer @nl
scope note: ISO LADM term
definition: A Natural person who is engaged in agriculture, cultivating land or crops or raising animals (such as livestock or fish) for food.
change note: Established with version 4. Broader is edited with version 5. Definition is added with version 6.
in scheme: CaLAThe 7.0
broader: Societal role

Fixed boundary
type: Concept
preferred label: Ejendomsgrænse, stedfæstet med koordinater @da
preferred label: Sabit sınır @tr
preferred label: Sempadan tetap @ms
preferred label: - @nl
definition: Boundaries fixed by reference to points in a geodetic network (Source: Bruce, 1998).
change note: Added with version 7.
in scheme: CaLAThe 7.0
broader: Boundary

Forced sale
type: Concept
preferred label: Tvangsauktion @da
preferred label: Zoraki satış @tr
preferred label: Jualan paksa @ms
preferred label: Gedwongen verkoop @nl
scope note: AGROVOC Multilingual Thesaurus term
definition: A sale of Real property under the process of the court against the consent of the Owner.
change note: Established with version 2. Close match http://www.eionet.europa.eu/gemet/concept/3401 deleted with version 4
in scheme: CaLAThe 7.0
alternative label: Foreclosure
alternative label: Repossesion
broader: Exchange

Formal tenure system
type: Concept
preferred label: Lovsikret ejendomsret @da
preferred label: Formel arazi rejimi @tr
preferred label: Sistem pegangan; Pemilikan rasmi @ms
preferred label: - @nl
definition: A tenure system created by statute (Source: Bruce, 1998).
change note: Added with version 7.
in scheme: CaLAThe 7.0
broader: Land law
broader: Land tenure
narrower: Freehold

Freehold
type: Concept
preferred label: Fast ejendom i privat eje @da
preferred label: - @tr
preferred label: Pegangan bebas @ms
definition: Full private ownership, that is, free of any obligations to the state other than payment of taxes and observance of land use controls imposed in the public interest (Source: Bruce, 1998).
change note: Added with version 7.
in scheme: CaLAThe 7.0
broader: Formal tenure system

Gazetteer
type: Concept
preferred label: Stednavnefortegnelse @da
preferred label: Yer adları dizini @tr
preferred label: Gazetir @ms
preferred label: - @nl
scope note: AGROVOC Multilingual Thesaurus term ISO 19112
definition: 1. A vocabulary consisting of identifiers, location descriptions, and attributes for a set of geospatial features (Source: Breitman, Casanova and Truszkowski, 2007). 2. Register of location instances of one or more location sub-types, containing some information regarding position. Note: The positional information need not be coordinates, but could be descriptive. (Source: ISO 19112:2019, (E), 3.1.1)
change note: Established with version 1. ISO definition added with version 6.
in scheme: CaLAThe 7.0
broader: Spatial data infrastructure
narrower: Place name

General boundary
type: Concept
preferred label: Ejendomsgrænse markeret i terrænet, f. eks. i form af vandløb, vej eller hegn @da
preferred label: Genel sınır @tr
preferred label: Sempadan am @ms
preferred label: - @nl
definition: Boundaries established by reference to physical features such as river or hedgerow (Source: Bruce, 1998).
change note: Added with version 7.
in scheme: CaLAThe 7.0
broader: Boundary

Geographic information system
type: Concept
preferred label: Geografisk informationssystem @da
preferred label: Coğrafi bilgi sistemi @tr
preferred label: Sistem maklumat geografi @ms
preferred label: Geografisch informatiesysteem @nl
scope note: AGROVOC Multilingual Thesaurus term ISO 19101-1
definition: information system dealing with information concerning phenomena associated with location relative to the Earth (Source: ISO 19101-1:2014, 4.1.20)
change note: Established with version 1. Definition added with version 6, and term edited from Geographical to Geographic, to follow ISO and general use. Relationships were edited with version 6.
broad match: c_35131
in scheme: CaLAThe 7.0
broader: Spatial data infrastructure
narrower: Cadastral system

Geographical grid system
type: Concept
preferred label: Geografiske kvadratnetsystemer @da
preferred label: Coğrafi grid sistemi @tr
preferred label: Sistem grid geografi @ms
preferred label: Geografisch referentiesysteem @nl
scope note: INSPIRE term
definition: Harmonised multi-resolution grid with a common point of origin and standardised location and size of grid cells [INSPIRE Directive] (Source: INSPIRE glossary).
change note: Established with version 1.
in scheme: CaLAThe 7.0
broader: Spatial reference

Geolocated information
type: Concept
preferred label: Stedbestemt information @da
preferred label: Coğrafi konumlandırılmış bilgi @tr
preferred label: Maklumat geolokasi @ms
preferred label: - @nl
definition: Information which is localized on the surface of the Earth through nominal, ordinal or metric means (cf Stevens, 1946; Stubkjær, 1992)
change note: Introduced with version 4
in scheme: CaLAThe 7.0
broader: Information
narrower: Place name
narrower: Spatial data infrastructure
narrower: Spatial network
narrower: Map
narrower: Digital imagery
narrower: Spatial unit

Geometric primitive
type: Concept
preferred label: Geometrisk objekt @da
preferred label: Geometrik obje @tr
preferred label: Geometrik primitif @ms
preferred label: - @nl
scope note: Geolexica term
definition: Geometric object representing a single, connected, homogeneous (isotropic) element of space (ISO 19107:2019, (E), 3.50).
change note: Established with version 1.
in scheme: CaLAThe 7.0
broader: Spatial unit
narrower: LA_Point based spatial unit
narrower: LA_Line based spatial unit
narrower: LA_Polygon based spatial unit
narrower: Curve
narrower: Surface
narrower: Point
narrower: LA_Point

Gift
type: Concept
preferred label: Gave @da
preferred label: Bağış @tr
preferred label: Hibah, Hadiah @ms
preferred label: Schenking @nl
definition: The voluntarily Transfer of Real property by the Owner to another Party without getting anything in return.
change note: Established with version 2.
in scheme: CaLAThe 7.0
broader: Transfer

GNSS observation
type: Concept
preferred label: GNSS gözlemi @tr
preferred label: Cerapan GNSS @ms
preferred label: - @nl
definition: GNSS observation contains all observations to one or more satellite systems. When using differential GNSS, also the information on the reference stations are included. (OGC LandInfra 7.8.3.9)
change note: Established with version 4
in scheme: CaLAThe 7.0
broader: Observation
broader: GNSS sensor

GNSS sensor
type: Concept
preferred label: GNSS modtager @da
preferred label: GNSS alıcısı @tr
preferred label: Penderia GNSS @ms
preferred label: - @nl
scope note: OGC LandInfra / InfraGML term
definition: GNSS sensors receive the signals from different satellite systems to determine a 3d location of the TargetPoint. External antennas could be also used. If differential GNSS was used GNSS sensor may also contain the sensor information of the reference station. GNSS class will then contain the reference aggregation of a GNNS reference sensor. (OGC LandInfra 7.8.5.13)
change note: Established with version 4
in scheme: CaLAThe 7.0
broader: Surveying instrument
narrower: GNSS observation

Good faith
type: Concept
preferred label: God tro @da
preferred label: İyi niyet @tr
preferred label: Niat baik @ms
preferred label: Te goeder trouw @nl
definition: Principle of honesty or sincerity of intention.
change note: Established with version 3.
in scheme: CaLAThe 7.0
broader: Rights holder

Governmental organisation
type: Concept
preferred label: Offentlig forvaltning @da
preferred label: Devlet kuruluşu @tr
preferred label: Organisasi kerajaan @ms
preferred label: - @nl
scope note: AGROVOC Multilingual Thesaurus term
definition: Any governmental agency or organization charged with managing and implementing regulations, laws and government policies (Source: AGROVOC).
change note: Established with version 1. Edited with version 4. Agency added with ver. 5.
in scheme: CaLAThe 7.0
alternative label: Administrative body
alternative label: Agency
broader: Organisation
narrower: Registry

Group party
type: Concept
preferred label: Gruppe @da
preferred label: Grup @tr
preferred label: Pihak berkumpulan @ms
preferred label: - @nl
scope note: ISO LADM term
definition: A Party type consisting of a number of Natural persons.
change note: Established with version 1. Definition is changed with version 6.
in scheme: CaLAThe 7.0
alternative label: LA_GroupParty
broader: Party type
narrower: Social group
narrower: Place bound party

Hydrography
type: Concept
preferred label: Hydrografi @da
preferred label: Hidroğrafya @tr
preferred label: Hidrografi @ms
preferred label: Hydrografie @nl
scope note: GEMET term
definition: Science which deals with the measurement and description of the physical features of the oceans, lakes, rivers, and their adjoining coastal areas, with particular reference to their control and utilization (Source: GEMET).
change note: Established with version 1.
in scheme: CaLAThe 7.0
broader: Topographical feature

Image
type: Concept
preferred label: Billede, Digitalbillede @da
preferred label: Görüntü @tr
preferred label: Imej @ms
preferred label: Foto @nl
scope note: OGC LandInfra / InfraGML term
definition: Image is the result of an ImageObservation (OCG LandInfra 7.8.7.8)
change note: Established with version 4.
in scheme: CaLAThe 7.0
broader: Camera
broader: Survey result

Indigenous tenure system
type: Concept
preferred label: - @da
preferred label: Yöreye özgü (yerel) arazi rejimi @tr
preferred label: Sistem pemilikan orang asli @ms
definition: Unwritten, customary tenure system (Source: Bruce, 1998).
change note: Added with version 7.
in scheme: CaLAThe 7.0
broader: Customary tenure

Individual ownership
type: Concept
preferred label: Selveje @da
preferred label: Bireysel mülkiyet @tr
preferred label: Pemilikan individu @ms
preferred label: - @nl
definition: Exercise of ownership towards property by an individual (Source: Legal Dictionary of Property in Canada - Dualjuridik).
change note: Established with version 1. Definition added with version 3.
in scheme: CaLAThe 7.0
broader: Ownership

Information
type: Concept
preferred label: Bilgi @tr
preferred label: Maklumat, Informasi @ms
preferred label: Informatie @nl
scope note: GEMET General Multilingual Environmental Thesaurus term
definition: All facts, ideas or imaginative works of the mind which have been communicated, published or distributed formally or informally in any format, or the knowledge that is communicated or received.
change note: Established as Documentation with version 1. Edited to Information in version 4.
in scheme: CaLAThe 7.0
narrower: Document
narrower: Metadata
narrower: Geolocated information
narrower: Spatial reference
narrower: Code list

Inheritance
type: Concept
preferred label: Arv @da
preferred label: Miras @tr
preferred label: Pewarisan @ms
preferred label: - @nl
definition: Rules for transferring property or other rights or obligations to heirs after the death of a (natural) person (Source: FAO, 2002).
change note: Established with version 2. Definition changed with version 7.
in scheme: CaLAThe 7.0
alternative label: Succession
broader: Transfer

Instrument point
type: Concept
preferred label: Opstillingspunkt @da
preferred label: Alet kurulan nokta @tr
preferred label: Titik peralatan @ms
preferred label: - @nl
definition: The geometric location of the used sensor. For differential GNSS Setups this is the position of the Basestation. (Source: OGC LandInfra 7.8.3.2)
change note: Established with version 7.
in scheme: CaLAThe 7.0
broader: Survey point

Judiciary
type: Concept
preferred label: Retsvæsen @da
preferred label: Yargı @tr
preferred label: Badan kehakiman @ms
preferred label: Rechterlijke macht @nl
scope note: STW Thesaurus for Economics term
change note: Established with version 1.
in scheme: CaLAThe 7.0
broader: Organisation

Land
type: Concept
preferred label: Arazi @tr
preferred label: Tanah @ms
preferred label: - @nl
definition: The area of earth's surface, excluding the oceans, usually marked off by natural or political boundaries, or boundaries of ownership (ISO 6707-1:2014).
change note: Established with version 1.
in scheme: CaLAThe 7.0
narrower: Spatial feature type

Land administration
type: Concept
preferred label: Forvaltning af ejendomsdata @da
preferred label: Arazi bilgi yönetimi @tr
preferred label: Pentadbiran tanah @ms
preferred label: - @nl
scope note: ISO LADM term
definition: The process of determining, recording and disseminating information about the relationship between people and land (ISO LADM, 4.1.10).
change note: Established with version 3.
related match: http://eurovoc.europa.eu/1157
in scheme: CaLAThe 7.0

Land consolidation
type: Concept
preferred label: Jordfordeling @da
preferred label: Arazi toplulaştırması @tr
preferred label: Penyatuan tanah @ms
preferred label: - @nl
definition: A Property restructuring of fragmented land units especially in rural areas into Cadastral parcels having more economic and rational size, shape, location, and access.
change note: Established with version 2.
in scheme: CaLAThe 7.0
broader: Property restructuring
narrower: Reallotment

Land division
type: Concept
preferred label: Opdeling af areal og rumlige enheder med administrativt eller ejendomsretligt formål. @da
preferred label: Coğrafi bölüm @tr
preferred label: Pecah sempadan tanah @ms
preferred label: Indeling @nl
scope note: OGC LandInfra / InfraGML term
definition: A spatial feature established to record boundaries. Land division may be public (political, judicial, or executive) or private in nature, the latter delimiting ownership in land or in alternative terms: boundaries of real estate, of real property or of immovable property (Source: OGC LandInfra, 7.10.1).
change note: Established with version 1. Term changed with version 3 to Land division, and definition added. Definition extended with version 7.
in scheme: CaLAThe 7.0
alternative label: Administrative feature
broader: Spatial feature type
narrower: Administrative unit
narrower: Real property
narrower: Marker
narrower: Place name
narrower: Boundary

Land law
type: Concept
preferred label: Ejendomsret (til fast ejendom) @da
preferred label: Taşınmaz (Gayrimenkul) hukuku @tr
preferred label: Undang-undang tanah @ms
preferred label: Goederenrecht @nl
definition: Positive law concerning real estate / immovable property, including property formation, land development, and implementation of spatial planning (Cf. Mattsson, 2001).
change note: Established with version 3.
in scheme: CaLAThe 7.0
alternative label: Property law
broader: Positive law
narrower: Real right
narrower: Planning law
narrower: LA_RRR
narrower: Law of obligation
narrower: Formal tenure system

Land readjustment
type: Concept
preferred label: Multifunktionel jordfordeling @da
preferred label: Arazi ve arsa düzenlemesi @tr
preferred label: Pelarasan semula tanah @ms
preferred label: Herbestemming @nl
definition: A Property restructuring that forms Cadastral parcels available for building according to land use plans.
change note: Established with version 2.
in scheme: CaLAThe 7.0
broader: Property restructuring
narrower: Reallotment

Land register
type: Concept
preferred label: Tingbogen (for fast ejendom) @da
preferred label: Tapu sicili @tr
preferred label: Daftar tanah @ms
preferred label: - @nl
scope note: FAO Agrovoc; UNECE, WPLA: Guidelines (https://unece.org/fileadmin/DAM/env/documents/2005/wpla/Guidelines_On_Real_Property_Identifiers.pdf)
definition: A public register, recording property rights and interest, or the existence of deeds or title documents. (Adopted from UNECE, WPLA: Guidelines, 2004, and FAO Agrovoc)
change note: Established with version 1. Definition, matches and relationships were edited with version 6. Sporadic registration added as narrower term with version 7.
broad match: http://www.eionet.europa.eu/gemet/concept/4644
in scheme: CaLAThe 7.0
broader: Land registry
narrower: Sporadic registration

Land registry
type: Concept
preferred label: Tingbogen (for fast ejendom) @da
preferred label: Tapu sicili @tr
preferred label: Daftar tanah @ms
preferred label: - @nl
scope note: ELRA (https://www.elra.eu/about-us/)
definition: A public register, recording property rights and interest, or the existence of deeds or title documents. (Adopted from UNECE, WPLA: Guidelines, 2004, and FAO Agrovoc)
change note: Established with version 1. Relations changed with version 5 and 6.
in scheme: CaLAThe 7.0
broader: Registry
broader: Cadastral system

Land tenure
type: Concept
preferred label: Ejendomsbesiddelse @da
preferred label: Arazi rejimi @tr
preferred label: Pegangan tanah; emilikan tanah @ms
preferred label: - @nl
definition: The relationship, whether legally or customarily defined, among people, as individuals or groups, with respect to land and associated natural resources (water, trees, minerals, wildlife, etc.). Rules of tenure define how property rights in land are to be allocated within societies. Land tenure systems determine who can use what resources for how long, and under what conditions (FAO, 2002).
change note: Added with version 7.
related match: http://eurovoc.europa.eu/962
in scheme: CaLAThe 7.0
broader: Common law
narrower: Formal tenure system
narrower: Customary tenure

Law
type: Concept
preferred label: Lov, Jura, Ret @da
preferred label: Hukuk @tr
preferred label: Undang-undang @ms
preferred label: Wet @nl
scope note: STW Thesaurus for Economics term
change note: Established with version 1. Narrower Civil law and Common law added with version 7.
narrow match: Grondslag
related match: https://www.eionet.europa.eu/gemet/en/concept/11499
in scheme: CaLAThe 7.0
narrower: Party role type
narrower: Customary law
narrower: Positive law
narrower: Natural law
narrower: Civil law
narrower: Common law

Law of obligation
type: Concept
preferred label: Obligationsret @da
preferred label: Borçlar Hukuku @tr
preferred label: Undang-undang tanggungjawab @ms
preferred label: Voorkeursrecht @nl
scope note: Added in version 5 to represent personal rights (cf. Swiss Civil Law, article 959) that can be entered into land book.
narrow match: VoorkeursrechtGemeenten
in scheme: CaLAThe 7.0
broader: Land law
narrower: Option to purchase
narrower: Pre-emption right

Lawyer
type: Concept
preferred label: Advokat @da
preferred label: Hukukçu @tr
preferred label: Peguam @ms
preferred label: Jurist @nl
definition: A Professional who is authorized to conduct lawsuits for clients or to advise as to legal rights and obligations in other matters.
change note: Established with version 3. Definition is added with version 6.
in scheme: CaLAThe 7.0
broader: Professional
narrower: Legal advisor

LA_AdministrativeSource
type: Concept
preferred label: - @da
scope note: ISO LADM term
definition: Source (4.1.21) with the administrative description (where applicable) of the parties (4.1.13) involved, the rights (4.1.20), restrictions (4.1.19) and responsibilities (4.1.18) created and the basic administrative units (4.1.2) affected (Source: ISO LADM, 4.1.1).
change note: Established with version 3.
in scheme: CaLAThe 7.0
broader: LA_Source

LA_BAUnit
type: Concept
preferred label: - @da
scope note: ISO LADM term
definition: Administrative entity, subject to registration, consisting of zero or more spatial units (4.1.23) against which (one or more) unique and homogeneous rights [e.g. ownership right or land (4.1.9) use right], responsibilities (4.1.18) or restrictions (4.1.19) are associated to the whole entity (Source: ISO LADM, 4.1.2 - here simplified)
change note: Established with version 1.
in scheme: CaLAThe 7.0
broader: Real property

LA_BoundaryFaceString
type: Concept
preferred label: - @da
scope note: ISO LADM term
change note: Established with version 3. Relation edited with version 4.
in scheme: CaLAThe 7.0
broader: Bounding element

LA_CertifiedSurveyor
type: Concept
preferred label: - @da
scope note: ISO LADM
change note: Established with version 4
in scheme: CaLAThe 7.0
broader: Surveyor

LA_Edge based spatial unit
type: Concept
preferred label: - @da
scope note: ISO LADM term
change note: Established with version 1. Edited with version 4
in scheme: CaLAThe 7.0
broader: Edge

LA_Face based spatial unit
type: Concept
preferred label: - @da
scope note: ISO LADM term
change note: Established with version 1. Edited with version 4.
in scheme: CaLAThe 7.0
broader: Face

LA_LegalSpaceBuildingUnit
type: Concept
preferred label: - @da
scope note: ISO LADM term
definition: Component of building (the legal, recorded or informal space of the physical entity) (Source: ISO LADM, 4.1.6).
change note: Established with version 3.
in scheme: CaLAThe 7.0
broader: Condominium building

LA_Line based spatial unit
type: Concept
preferred label: - @da
scope note: ISO LADM term
change note: Established with version 1. Edited to LA_Line .. with version 4
in scheme: CaLAThe 7.0
broader: Geometric primitive

LA_Node based spatial unit
type: Concept
preferred label: - @da
scope note: ISO LADM term
change note: Introduced with version 1. Edited with version 4
in scheme: CaLAThe 7.0
broader: Node

LA_Point
type: Concept
preferred label: - @da
scope note: LADM term
definition: 0-dimensional geometric primitive, representing a position [ISO 19107:2003, 4.61] (Source: ISO LADM, 4.1.15).
change note: Established with version 3.
in scheme: CaLAThe 7.0
broader: Geometric primitive

LA_Point based spatial unit
type: Concept
preferred label: - @da
scope note: ISO LADM term
change note: Established with version 1.0. Changed to LA_Point... with version 4
in scheme: CaLAThe 7.0
broader: Geometric primitive

LA_Polygon based spatial unit
type: Concept
preferred label: - @da
scope note: ISO LADM term
change note: Established with version 1.0. Edited to LA_Polygon.. with version 4
in scheme: CaLAThe 7.0
broader: Geometric primitive

LA_RequiredRelationship
type: Concept
preferred label: - @da
scope note: LADM term
change note: Established with version 3, revised as concept in version 5.
in scheme: CaLAThe 7.0
broader: Real property

LA_Restriction
type: Concept
preferred label: - @da
scope note: ISO LADM term
definition: Formal or informal obligation to refrain from doing something (Source: ISO LADM, 4.1.18).
change note: Established with version 3.
in scheme: CaLAThe 7.0
broader: Encumbrance

LA_Right
type: Concept
preferred label: - @da
scope note: ISO LADM term
definition: Action, activity or class of actions that a system participant may perform on or using an associated resource [ISO 19132:2007, 4.38] (Source: ISO LADM, 4.1.20).
change note: Established with version 3.
in scheme: CaLAThe 7.0
broader: Real right

LA_RRR
type: Concept
preferred label: - @da
scope note: ISO LADM term
definition: LA_RRR is an abstract class with three specialization classes: LA_Right, with rights as instances, LA_Restriction, with restrictions as instances, and LA_Responsibility, with responsibilities as instances. In principle, all rights, restrictions and responsibilities are based on an administrative source, as instances from class LA_AdministrativeSource (Source: ISO LADM, 5.4).
change note: Established with version 3.
in scheme: CaLAThe 7.0
broader: Land law

LA_Source
type: Concept
preferred label: - @da
scope note: ISO LADM term
definition: Document providing legal and/or administrative facts on which the land administration (LA) object [right (4.1.20), restriction (4.1.19), responsibility (4.1.18), basic administrative unit (4.1.2), party (4.1.13), or spatial unit (4.1.23)] is based on (Source: ISO LADM, 4.1.21).
change note: Established with version 3.
in scheme: CaLAThe 7.0
broader: Document
narrower: LA_AdministrativeSource
narrower: LA_SpatialSource

LA_SpatialSource
type: Concept
preferred label: - @da
scope note: ISO LADM term
definition: Source (4.1.21) with the spatial representation of one (part of) or more spatial units (4.1.23) (Source: LADM, 2012, 4.1.22).
change note: Established with version 3.
in scheme: CaLAThe 7.0
broader: LA_Source

Lease
type: Concept
preferred label: Lejemål, Forpagtning @da
preferred label: - @tr
preferred label: Pajakan @ms
definition: A contractual agreement between the Lessor and the Lessee that gives the Lessee certain rights over the Real property for a specified term and usually for a specified Rent.
change note: Established with version 2. Relation to Leasehold added with version 3. Definition changed with version 7.
in scheme: CaLAThe 7.0
broader: Exchange
related: Leasehold

Leasehold
type: Concept
preferred label: Forpagtning @da
preferred label: - @tr
preferred label: Pegangan pajakan @ms
scope note: EULIS / ELRA term
definition: The right to possess immovable property for an agreed period of time in return for an agreed consideration (Source: EULIS / ELRA glossary).
change note: Established with version 3.
in scheme: CaLAThe 7.0
broader: Real right
related: Lease

Legal advisor
type: Concept
preferred label: Juridisk rådgiver @da
preferred label: Yasal danışman @tr
preferred label: Penasihat undang-undang @ms
preferred label: Juridisch adviseur @nl
change note: Established with version 1.
in scheme: CaLAThe 7.0
broader: Lawyer

Legal person
type: Concept
preferred label: Juridisk person @da
preferred label: Tüzel kişi @tr
preferred label: Pengamal undang-undang @ms
preferred label: - @nl
definition: An Organisation endowed with a Legal personality.
change note: Established with version 1. Definition and relation to Organisation added with version 3. Broader edited with version 4. Definition changed with version 6.
in scheme: CaLAThe 7.0
broader: Organisation

Legal personality
type: Concept
preferred label: Retsevne, Retlig status @da
preferred label: Tüzel kişilik @tr
preferred label: Personaliti undang-undang @ms
preferred label: Rechtspersoonlijkheid @nl
definition: The lawful characteristics and qualities of a Party.
change note: Established with version 1. Edited from Personal right to Legal personality with version 5 to comply with dictionaries, incl EuroVoc. Definition is added with version 6.
in scheme: CaLAThe 7.0
broader: Natural person role
narrower: Signatory

Lessee
type: Concept
preferred label: Forpagter @da
preferred label: Kiracı @tr
preferred label: Penerima pajak @ms
preferred label: - @nl
scope note: EULIS / ELRA term
definition: A Party to whom a Lease is granted.
change note: Established with version 3. Definition is changed with version 6.
in scheme: CaLAThe 7.0
broader: Rights holder

Lessor
type: Concept
preferred label: Bortforpagter @da
preferred label: Kiraya veren @tr
preferred label: Pemberi pajak @ms
preferred label: - @nl
scope note: EULIS / ELRA term
definition: A Party who grants a Lease.
change note: Established with version 3. Definition is changed with version 6.
in scheme: CaLAThe 7.0
broader: Rights holder

Level observation
type: Concept
preferred label: Højdemåling @da
preferred label: Düzey gözlemi @tr
preferred label: Aras cerapan @ms
preferred label: - @nl
scope note: OGC LandInfra / InfraGML term
definition: A LevelObservation contains elevation difference from the InstrumentPoint to the TargetPoint. (Source: OGC LandInfra 7.8.3.8)
change note: Established with version 4. Definition added with version 7.
in scheme: CaLAThe 7.0
broader: Leveling instrument
broader: Observation

Leveling instrument
type: Concept
preferred label: Nivellerinstrument @da
preferred label: Nivelman araçları @tr
preferred label: Alat pengarasan @ms
preferred label: Waterpasinstrument @nl
definition: Level sensors are used to determine the height difference between two locations (OGC LandInfra 7.8.5.11)
change note: Established with version 4
in scheme: CaLAThe 7.0
broader: Surveying instrument
narrower: Level observation

Licensed surveyor
type: Concept
preferred label: Landinspektør med beskikkelse @da
preferred label: Lisanslı haritacı @tr
preferred label: Juruukur berlesen @ms
preferred label: Landmeter @nl
scope note: OGC LandInfra / InfraGML term
definition: A publicly appointed Surveyor, authorized to perform Property formation on behalf of the state.
broad match: c 26e30c73
change note: Established with version 1. Definition is added with version 4, and changed with version 6.
in scheme: CaLAThe 7.0
broader: Surveyor

Lien
type: Concept
preferred label: Tilbageholdsret @da
preferred label: Rehin hakkı @tr
preferred label: Pandrecht @nl
change note: Established with version 3.
in scheme: CaLAThe 7.0
broader: Mortgage

Liminal
type: Concept
preferred label: - @da
scope note: ISO 19152:2012 and OGC LandInfra / InfraGML term
definition: Spatial unit on the threshold between 2D and 3D representations (ISO 19152:2012, 4.1.12, cf. OGC LandInfra 7.10.6 SpatialUnit)
change note: Established with version 4. Added definition with version 6.
related match: https://isotc211.geolexica.org/concepts/1302/
in scheme: CaLAThe 7.0
broader: Dimension type

Line string
type: Concept
preferred label: Kurve, dannet af rette linjer @da
preferred label: Düz çizgi @tr
preferred label: Rantaian garisan @ms
preferred label: - @nl
scope note: Geolexica term
definition: Curve composed of straight-line segments (Geolexica ISO 19136-1:2020)
change note: Established with version 4
in scheme: CaLAThe 7.0
broader: Curve
broader: BEString
narrower: Point

LI_LandSurveyor
type: Concept
preferred label: - @da
scope note: OGC LandInfra
change note: Established with version 4
in scheme: CaLAThe 7.0
broader: Surveyor
broader: Signatory

LI_Sensor
type: Concept
preferred label: - @da
scope note: OGC LandInfra / InfraGML term
definition: Element of a measuring system that is directly affected by a phenomenon, body, or substance carrying a quantity to be measured (Source: ISO/TC 211 Glossary of Terms - English).
change note: Established with version 4
in scheme: CaLAThe 7.0
broader: Surveying instrument

Main Parcel
type: Concept
preferred label: Hovedparcel @da
preferred label: Ana parsel (taşınmaz) @tr
preferred label: Petak utama @ms
preferred label: - @nl
scope note: OGC LandInfra / InfraGML term
definition: Optional indication of a current LandParcel which is part of a LandPropertyUnit with more LandParcels, and which is chosen as reference for all LandParcels in the LandPropertyUnit. May be applied in jurisdictions where legal provisions do not recognize the concept of LandPropertyUnit (LandInfra 7.10.2.5)
change note: Established with version 4
in scheme: CaLAThe 7.0
broader: Cadastral parcel

Map
type: Concept
preferred label: Kort, Landkort @da
preferred label: Harita @tr
preferred label: Peta @ms
preferred label: - @nl
scope note: GEMET term
definition: A representation, normally on a flat medium, that displays the physical and political features of a surface area of the earth, showing them in their respective forms, sizes and relationships according to some convention of representation.
change note: Established with version 1.
narrow match: https://isotc211.geolexica.org/concepts/282/
in scheme: CaLAThe 7.0
broader: Geolocated information
narrower: Cadastral map
narrower: Topographic map

Marker
type: Concept
preferred label: Markør @da
preferred label: Sınır işareti @tr
preferred label: Penanda @ms
preferred label: Markering @nl
definition: Pole, plate, or other, used for marking and/or naming a location.
change note: Established with version 1. Definition is added in version 5.
in scheme: CaLAThe 7.0
broader: Land division
narrower: Survey mark
narrower: Street sign

Measuring tape
type: Concept
preferred label: Målebånd @da
preferred label: Şerit metre @tr
preferred label: Pita ukur @ms
preferred label: Meetlint @nl
definition: Labeled GenericDistance sensor (Source: OGC LandInfra 7.8.5.6)
change note: Established with version 4. Label added with version 7.
in scheme: CaLAThe 7.0
broader: Surveying instrument
narrower: Distance observation

Metadata
type: Concept
preferred label: Metaveri @tr
scope note: ISO 19115-1
definition: Information about a resource. (Source: ISO 19115-1:2014, 4.10)
change note: Established with version 2. Broader relation changed with version 3 and 4
in scheme: CaLAThe 7.0
broader: Information

Mortgage
type: Concept
preferred label: Pantehæftelse @da
preferred label: İpotek @tr
preferred label: Gadai janji @ms
preferred label: - @nl
scope note: STW Thesaurus for Economics term
definition: (1) A security right to secure payment of a debt or other financial obligation (Source: EULIS / ELRA glossary). (2) A contract by which a borrower commits land as security for a loan (Source: Bruce, 1998).
change note: Established with version 1. Changed with version 3 as narrower of Security right. Bruce (1998) definition added with version 7.
in scheme: CaLAThe 7.0
alternative label: LA_Mortgage
broader: Security interest
narrower: Lien

Mortgage deed
type: Concept
preferred label: Pantebrev @da
preferred label: İpotek sözleşmesi @tr
preferred label: Surat ikatan gadai janji @ms
preferred label: - @nl
change note: Established with version 1.
in scheme: CaLAThe 7.0
broader: Deed

Mortgagee
type: Concept
preferred label: Panthaver @da
preferred label: İpotek alacaklısı @tr
preferred label: Pemegang gadai janji @ms
preferred label: - @nl
definition: A Party that lends money through a Mortgage loan and thus obtain legal mortgage in Real property as collateral for the loan.
change note: Established with version 1. Definition is added with version 6.
in scheme: CaLAThe 7.0
broader: Rights holder

Mortgaging
type: Concept
preferred label: Pantsætning @da
preferred label: İpotek tesisi @tr
preferred label: Menggadaikan @ms
preferred label: Hypothekeren @nl
definition: An Exchange between a Mortgagee (or creditor) and a Mortgagor (debtor) implying a loan of money for which re-payment is secured by giving the Mortgagee the right to sell the concerned Real property and keep the value of unpaid mortgage and interest, when the loan is not paid off in accordance with the agreed stipulations.
change note: Established with version 2.
related match: Hypotheekgever
related match: Hypotheeknemer
related match: Hypotheekbedrag
related match: RechtVanHypotheek
in scheme: CaLAThe 7.0
broader: Exchange

Mortgagor
type: Concept
preferred label: Låntager @da
preferred label: İpotek borçlusu @tr
preferred label: Penggadai @ms
preferred label: - @nl
definition: A Party that borrows money through a Mortgage loan and thus pledge Real property as collateral for the loan.
change note: Established with version 2. Definition is added with version 6.
in scheme: CaLAThe 7.0
broader: Rights holder

Natural law
type: Concept
preferred label: Naturret @da
preferred label: Doğal hukuk @tr
preferred label: Undang-undang semula jadi @ms
preferred label: Gewoonterecht @nl
definition: Determinism qualifying the law in a State where the legal order is not established by convention (Source: Legal Dictionary of Property in Canada - Dualjuridik).
change note: Established with version 3.
in scheme: CaLAThe 7.0
broader: Law

Natural person
type: Concept
preferred label: Fysisk person @da
preferred label: Gerçek kişi @tr
preferred label: Manusia biasa @ms
preferred label: - @nl
definition: Individual human being.
change note: Established with version 1. Narrower to Legal subject deleted with ver. 5; replaced by Legal personality. Definition is added with version 6.
in scheme: CaLAThe 7.0
broader: Party type

Natural person role
type: Concept
preferred label: Rolle for fysisk person @da
preferred label: Gerçek kişi rolü @tr
preferred label: Peranan manusia biasa @ms
preferred label: De rol van een natuurlijke persoon rol @nl
definition: A Party role type which an individual human being may play.
change note: Established with version 1. Definition is added with version 6.
in scheme: CaLAThe 7.0
broader: Party role type
narrower: Official role
narrower: Societal role
narrower: Professional
narrower: Legal personality

Neighbor
type: Concept
preferred label: Nabo @da
preferred label: Komşu @tr
preferred label: Jiran @ms
preferred label: Buurman @nl
definition: Natural persons, Groups and Organisations who share boundary or are located in the neighbourhood.
change note: Established with version 4. Context changed with version 5 (no relation to Signatory). Definition is added with version 6.
in scheme: CaLAThe 7.0
broader: Societal role

Node
type: Concept
preferred label: Knude @da
preferred label: Düğüm noktası @tr
preferred label: Nod @ms
scope note: ISO 19107:2019
definition: 0-dimensional topological primitive (ISO 19107:2019, (E), 3.69)
change note: Established with version 1. Edited with versions 4 and 6
in scheme: CaLAThe 7.0
broader: Topological primitive
narrower: LA_Node based spatial unit

Notary
type: Concept
preferred label: Notar @da
preferred label: Noter @tr
preferred label: Notari @ms
preferred label: - @nl
definition: A public Official who is authorized to authenticate Deeds and other Documents by an appropriate certificate on behalf of the state.
change note: Established with version 1. Definition is added with version 6.
in scheme: CaLAThe 7.0
broader: Professional

NUTS Region
type: Concept
preferred label: Regional statistikenhed @da
preferred label: İstatistiki Bölge Birimleri @tr
preferred label: Wilayah NUTS @ms
preferred label: - @nl
scope note: INSPIRE term
definition: Territorial unit for statistics defined in the framework of the Regulation (EC) No 1059/2003 of the European Parliament and of the Council of 26 May 2003 (INSPIRE feature concept dictionary).
change note: Established with version 2.
in scheme: CaLAThe 7.0
broader: Administrative unit

Observation
type: Concept
preferred label: Gözlem @tr
preferred label: Pemerhatian, cerapan @ms
preferred label: - @nl
scope note: OGC LandInfra / InfraGML term
definition: Act of measuring or otherwise determining the value of a property (Source: ISO 19156:2011, 4.11; quoted from OGC LandInfra 4.6.12).
change note: Established with version 4
in scheme: CaLAThe 7.0
broader: Surveying instrument
narrower: Distance observation
narrower: Angle observation
narrower: TPSobservation
narrower: Level observation
narrower: GNSS observation
narrower: Correction

Official role
type: Concept
preferred label: Embedsmand @da
preferred label: Resmi rol @tr
preferred label: Peranan rasmi @ms
preferred label: Officiële rol @nl
definition: A Natural person who has a position of responsibility in a governmental organization.
change note: Established with version 1. Alternative label is added with version 3, and then removed with version 4. Definition is added with version 6.
in scheme: CaLAThe 7.0
broader: Natural person role
narrower: Registrar

Option to purchase
type: Concept
preferred label: Køberet @da
preferred label: Alım hakkı @tr
preferred label: Opsyen beli @ms
preferred label: - @nl
scope note: EULIS / ELRA term.
definition: A right that entitles a person to compel the owner to sell or grant the property, but does not impose on him any duty to buy (EULIS / ELRA glossary).
change note: Established with version 3.
in scheme: CaLAThe 7.0
broader: Law of obligation

Ordinal scale
type: Concept
preferred label: Ordinalskala @da
preferred label: Ordinal ölçek @tr
preferred label: Skala ordinal @ms
preferred label: - @nl
scope note: Stevens, S. S. (7 June 1946)."On the Theory of Scales of Measurement". Science. 103 (2684): 677â680. ISO 19108:2002
definition: Scale which provides a basis for measuring only the relative position of an object. (ISO 19108:2002). Note: The ordinal scale may be used for ordering of geospatial features, e.g. floors/ stories, or elements of a road network
change note: Established with version 1. Definition added with version 5. Term edited from Ordinal reference frame to Ordinal scale, and definition edited to reflect ISO 19108:2002 with version 6.
in scheme: CaLAThe 7.0
broader: Spatial reference

Organisation
type: Concept
preferred label: Kuruluş @tr
preferred label: Organisasi @ms
preferred label: Organisatie @nl
scope note: GEMET term
definition: A purpose-oriented administrative and functional structure, specified in writing.
change note: Established with version 1. Relation to Legal person added in version 3 and edited to Narrower in version 4. Definition supplemented in version 4, and changed in version 6.
in scheme: CaLAThe 7.0
broader: Party type
narrower: Governmental organisation
narrower: Judiciary
narrower: Corporation
narrower: Association
narrower: Legal person

Orthoimagery
type: Concept
preferred label: Ortofoto @da
preferred label: Ortogörüntü @tr
preferred label: Ortoimej @ms
preferred label: Orthofotografie @nl
scope note: INSPIRE term
definition: Georeferenced image data of the Earths surface, from either satellite or airborne sensors.
change note: Established with version 1. Definition added and matches edited with version 6.
in scheme: CaLAThe 7.0
broader: Digital imagery

Owner
type: Concept
preferred label: Ejer @da
preferred label: Malik, Sahip @tr
preferred label: Pemilik @ms
preferred label: - @nl
scope note: STW Thesaurus for Economics term
definition: Subject of ownership and holder of the prerogatives that are attached to it (Source: Legal Dictionary of Property in Canada - Dualjuridik).
change note: Established with version 1. Definition added with version 3.
in scheme: CaLAThe 7.0
broader: Rights holder
broader: Signatory
narrower: Title

Ownership
type: Concept
preferred label: Ejendomsret (til fast ejendom) @da
preferred label: Mülkiyet @tr
preferred label: Pemilikan @ms
preferred label: - @nl
scope note: GEMET term
definition: Collection of rights to use and enjoy property, including right to transmit it to others. The complete dominion, title, or proprietary right in a thing or claim (Source: Black, 1991). Possessive relationship with a title established between an owner and their property (Source: Legal Dictionary of Property in Canada - Dualjuridik). Includes the right to grant a lease, an easement, or a security interest and other lesser rights. Ownership in land includes buildings and fixture on the land parcel, unless lawful process is performed in terms of establishment of condominium units (Source: OGC LandInfra, 4.8.13)
change note: Established with version 1. Changed and defined with version 3.
in scheme: CaLAThe 7.0
alternative label: Private ownership
broader: Real right
narrower: Individual ownership
narrower: Public ownership
narrower: Co-ownership
narrower: Adverse possession

Parcel acquisition
type: Concept
preferred label: Erhvervelse af del af fast eje @da
preferred label: Parsel edinimi @tr
preferred label: Pengambilan petak @ms
preferred label: - @nl
scope note: OGC LandIfra / InfraGML term
definition: A Conveyance of a Cadastral parcel from a Buyer to a Seller (Source: OGC LandInfra, 7.10.4.1).
change note: Established with version 3.
in scheme: CaLAThe 7.0
broader: Conveyance

Parcel establishment
type: Concept
preferred label: Matrikulering @da
preferred label: Parsel oluşturma @tr
preferred label: Penubuhan petak @ms
preferred label: Perceelsvorming @nl
scope note: OGC LandInfra / InfraGML term
definition: A Property formation either through an initial cadastral Survey or change of existing Cadastral parcels (Source: OGC 7.10.4.1).
change note: Established with version 3. Edited to refer to Property formation only in version4
in scheme: CaLAThe 7.0
broader: Property formation

Partition
type: Concept
preferred label: Skifte, Fraskillelse @da
preferred label: Taksim @tr
preferred label: Pecah bahagian @ms
preferred label: - @nl
scope note: EULIS / ELRA term
definition: Division of a Real property into separate portions representing the Party shares of the owners in the Real property.
change note: Established with version 3. Related to broader: Transfer with version 5
in scheme: CaLAThe 7.0
broader: Transfer

Party
type: Concept
preferred label: Aktør @da
preferred label: Aktör @tr
preferred label: Pihak @ms
preferred label: - @nl
scope note: ISO LADM and OGC LandInfra / InfraGML term
definition: A Natural person or a Group of natural persons or an Organisation that play Professional (role), Official role, Societal role or Legal personality in a lawful processes.
change note: Established with version 1. Definition is changed with version 6.
in scheme: CaLAThe 7.0
alternative label: LA_Party
narrower: Party role type
narrower: Party type

Party member
type: Concept
preferred label: Gruppemedlem @da
preferred label: Grup üyesi @tr
preferred label: Ahli pihak @ms
preferred label: Partijleden @nl
scope note: ISO LADM term
definition: One of the Parties composing a Group party.
change note: Established with version 1. Definition is added with version 6.
in scheme: CaLAThe 7.0
alternative label: LA_PartyMember
broader: Rights holder
related: Place bound party

Party role type
type: Concept
preferred label: Aktørrolle @da
preferred label: Aktör rolü @tr
preferred label: Jenis peranan pihak @ms
preferred label: - @nl
scope note: ISO LADM term
change note: Established with version 1.
in scheme: CaLAThe 7.0
broader: Party
broader: Law
narrower: Rights holder
narrower: Natural person role

Party share
type: Concept
preferred label: Andel @da
preferred label: Pay @tr
preferred label: Syer pihak @ms
preferred label: Deel van mede-eigendom @nl
change note: Established with version 1 and specified as narrower of Co-ownership share in version 3.
in scheme: CaLAThe 7.0
broader: Co-ownership share
related: Party member

Party type
type: Concept
preferred label: Aktørtype @da
preferred label: Aktör tipi @tr
preferred label: Jenis pihak @ms
preferred label: - @nl
scope note: ISO LADM term
change note: Established with version 1.0
in scheme: CaLAThe 7.0
broader: Party
narrower: Natural person
narrower: Group party
narrower: Organisation

Place bound party
type: Concept
preferred label: Stedbestemt gruppe @da
preferred label: - @tr
preferred label: Pihak yang dibenarkan @ms
change note: Established with version 1.0
in scheme: CaLAThe 7.0
broader: Group party
related: Party member

Place name
type: Concept
preferred label: Stednavn @da
preferred label: Yer adı @tr
preferred label: Nama tempat @ms
preferred label: Plaastnaam @nl
definition: One or several proper nouns used to identify a real world entity.
change note: Established with version 2. Definition added with version 4. Related Match added with version 6.
in scheme: CaLAThe 7.0
related match: https://isotc211.geolexica.org/concepts/1280/
alternative label: Geographical name
broader: Gazetteer
broader: Land division
broader: Geolocated information
narrower: Postal address

Planning law
type: Concept
preferred label: Arealplanægning @da
preferred label: Planlama hukuku @tr
preferred label: Undang-undang perancangan @ms
preferred label: Wet ruimtelijke ordening @nl
scope note: GEMET term
definition: A binding rule or body of rules prescribed by a government to organize, designate and regulate land use within its domain through zoning laws, subdivision regulations, rent and sign controls, growth management and other measures designed to protect human health and ecological integrity (Source: GEMET)
change note: Established with version 1.0. Broader relation changed from Property law to Land law with version 3.
broad match: LawfulBasis
in scheme: CaLAThe 7.0
broader: Land law
narrower: Public law restriction

Point
type: Concept
preferred label: Punkt @da
preferred label: Nokta @tr
preferred label: Titik @ms
preferred label: - @nl
scope note: Geolexica term
definition: (Ground control point) Point on the earth that has an accurately known geographic position (Source: ISO 19115-2:2019, (E), 3.17; ISO 19115-2:2009(E))
change note: Established with version 4
in scheme: CaLAThe 7.0
broader: Geometric primitive
broader: Line string

Point cloud
type: Concept
preferred label: Punktsky @da
preferred label: Nokta bulutu @tr
preferred label: Awan titik @ms
preferred label: Puntenwolk @nl
scope note: OGC LandInfra / InfraGML term
definition: 1. PointCloud is the result of a PointCloudObservation. (Source: OGC LandInfra 7.8.7.9) 2. Collection of data points in 3D space. Note to entry: The distance between points is generally non-uniform and hence all three coordinates (Cartesian or spherical) for each point must be specifically encoded. (Source: ISO/TS 19130-2:2014, 4.51).
change note: Established with version 4. Definition edited with version 7.
in scheme: CaLAThe 7.0
broader: Terrestrial Laser Scanner
broader: Survey result

Polygon
type: Concept
preferred label: Poligon, Çoklu doğru @tr
preferred label: Poligon @ms
preferred label: Polygoon @nl
scope note: Geolexica term
definition: Planar surface defined by 1 exterior boundary and 0 or more interior boundaries (Geolexica, ISO 19136-1:2020)
change note: Established with version 4
in scheme: CaLAThe 7.0
broader: Surface
narrower: Curve

Positive law
type: Concept
preferred label: Positiv ret @da
preferred label: Pozitif hukuk @tr
preferred label: Perundangan utama @ms
preferred label: Positief stelsel @nl
definition: Conventional legal order prevailing in a State and expressing itself through statutes and jurisprudence (Source: Legal Dictionary of Property in Canada - Dualjuridik).
change note: Established with version 3.
in scheme: CaLAThe 7.0
alternative label: Legal basis
alternative label: Formal right
broader: Law
narrower: Land law

Postal address
type: Concept
preferred label: Postadresse @da
preferred label: Posta adresi @tr
preferred label: Alamat pos @ms
preferred label: Postadres @nl
scope note: INSPIRE term
definition: Set of information which, for a postal item, allows the unambiguous determination of an actual or potential delivery point, usually combined with the specification of an addressee and/or mailee. (INSPIRE Source: Universal Postal Union 2006). Structured information that allows the unambiguous determination of an [real world] object for purposes of identification and location (Geolexica)
change note: Established with version 1. Edited in version 3 as Postal address to comply with INPSIRE specifications. Definitions edited with version 4
in scheme: CaLAThe 7.0
alternative label: Address
broader: Place name
broader: Road network
narrower: Street sign

Pre-emption right
type: Concept
preferred label: Forkøbsret @da
preferred label: Ön alım hakkı @tr
preferred label: Hak keutamaan @ms
preferred label: - @nl
definition: The owner of land has contracted that if he decides to sell the land he first will offer it to the other contracting party.
in scheme: CaLAThe 7.0
broader: Law of obligation

Prescriptive acquisition
type: Concept
preferred label: Hævdserhvervelse @da
preferred label: Kazandırıcı zamanaşımı @tr
preferred label: Pemilikan menentang @ms
preferred label: - @nl
scope note: EULIS / ELRA term
definition: Acquiring ownership of land by possession over a long of time, which is open and without permission of the owner and during which the possessor acts as if s/he were the owner (Source: Bruce, 1998).
change note: Established with version 3. Introduced as alternative term in version 6. Definition added in version 7.
in scheme: CaLAThe 7.0
broader: Transfer
related: Adverse possession

Private law restriction
type: Concept
preferred label: Privatretlig regulering @da
preferred label: Özel hukuk kısıtlaması @tr
preferred label: Sekatan undang-undang sivil @ms
preferred label: - @nl
change note: Established with version 1.
in scheme: CaLAThe 7.0
broader: Easement
narrower: Right of way

Professional
type: Concept
preferred label: Professionel @da
preferred label: Profesyonel @tr
preferred label: Profesional @ms
scope note: OGC LandInfra / InfraGML term
definition: A Natural person generally with tertiary education, who through a license is bound to act according to the standards of a professional association.
change note: Established with version 3. Definition is added with version 6.
in scheme: CaLAThe 7.0
alternative label: Professional role
broader: Natural person role
narrower: Notary
narrower: Surveyor
narrower: Draftsman
narrower: Lawyer
narrower: Engineer

Professional society
type: Concept
preferred label: Professionsforening @da
preferred label: Profesyonel cemiyet @tr
preferred label: Persatuan profesional @ms
preferred label: Beroepsvereniging @nl
scope note: GEMET term
definition: A group of persons engaged in the same profession, business, trade or craft that is organized or formally structured to attain common ends (Source: Random House, 1997).
change note: Established with version 3.
in scheme: CaLAThe 7.0
alternative label: Professional association
broader: Association

Property enquiry certificate
type: Concept
preferred label: - @da
preferred label: Sijil siasatan harta @ms
preferred label: Officieël bewijsstuk @nl
scope note: esd-toolkit.eu term
definition: When a property is being sold in the UK, a solicitor will carry out conveyancing duties which normally include a property search. The local authority can carry out these searches and provide a Property Enquiry Certificate, detailing issues relating to Planning, Building Control, Environmental Health, Housing, Roads, etc (Source: esd-toolkit.eu).
change note: Established with version 1. Â´in the UKÂ´ added to definition with version 6.
in scheme: CaLAThe 7.0
broader: Certificate

Property formation
type: Concept
preferred label: Ejendomsdannelse @da
preferred label: Taşınmaz oluşturma @tr
preferred label: Pembentukan harta @ms
preferred label: - @nl
definition: An Activity establishing or changing boundaries of Real property or Real rights, performed by a Professional according to Law.
change note: Established with version 2.0. Related to ParcelEstablishment with version 3. ParcelEstablishment made narrower with version 4
in scheme: CaLAThe 7.0
alternative label: Cadastral activity
broader: Activity
narrower: Change of property unit type
narrower: Transfer of part of property
narrower: Amalgamation
narrower: Subdivision
narrower: Property restructuring
narrower: Superficie object establishment
narrower: Parcel establishment

Property restructuring
type: Concept
preferred label: Områdevis ejendomsændring @da
preferred label: Taşınmaz yapılandırma @tr
preferred label: Penstrukturan semula harta @ms
preferred label: - @nl
definition: Property formation addressing a larger number of Real properties within a single case.
change note: Established with version 2.0.
in scheme: CaLAThe 7.0
broader: Property formation
narrower: Land consolidation
narrower: Land readjustment
narrower: Expropriation

Property unit type
type: Concept
preferred label: Ejendomstype @da
preferred label: Taşınmaz cinsi @tr
preferred label: Jenis unit harta @ms
preferred label: Eigendomstypen @nl
definition: Code list of admitted property unit types within a jurisdiction (Adopted from LA_BAUnitType).
change note: Established with version 1. Definition is added in version 5.
broad match: Eigendom
in scheme: CaLAThe 7.0
broader: Real property

Protected site
type: Concept
preferred label: Beskyttet lokalitet @da
preferred label: Korunan alan @tr
preferred label: Tapak yang dilindungi @ms
preferred label: Beschermd gebied @nl
scope note: INSPIRE term
definition: An area designated or managed according to jurisdiction legislation to achieve specific conservation objectives (Adopted from INSPIRE, http://inspire.ec.europa.eu/featureconcept/ProtectedSite).
change note: Established with version 2. Definition is added in version 5.
related match: BeschermdNatuurmonument
related match: BeschermdeLeefomgevingFloraEnFaunawet
narrow match: BeschermdMonument
in scheme: CaLAThe 7.0
broader: Administrative unit

Public law restriction
type: Concept
preferred label: Offentligretlig regulering @da
preferred label: Kamu hukuku kısıtlaması @tr
preferred label: Sekatan undang-undang awam @ms
preferred label: - @nl
change note: Established with version 1.
in scheme: CaLAThe 7.0
broader: Easement
broader: Planning law
narrower: Right of way

Public ownership
type: Concept
preferred label: Offentlig ejendom @da
preferred label: Kamu taşınmazı @tr
preferred label: Pemilikan awam @ms
preferred label: Publiek eigendom @nl
scope note: AGROVOC Multilingual Thesaurus term
change note: Established with version 1.
in scheme: CaLAThe 7.0
broader: Ownership

Real property
type: Concept
preferred label: Bestemt fast ejendom @da
preferred label: Taşınmaz, Gayrimenkul @tr
preferred label: Harta tanah @ms
preferred label: - @nl
definition: 1. One or more Cadastral parcels, which are owned by the same party, and recorded as a unit according jurisdiction provisions, or 2. Condominium, or 3. Superficie object
change note: Established with version 1.0. Changed narrower from Building use part to Condominium with version 3. Definition is added in version 5, and the concept is renamed Real property, while the previous term Property unit is maintained as altLabel.
in scheme: CaLAThe 7.0
alternative label: Basic property unit
alternative label: Immovable property
alternative label: Property unit
broader: Land division
narrower: Cadastral parcel
narrower: Property unit type
narrower: Condominium
narrower: Superficie object
narrower: LA_BAUnit
narrower: LA_RequiredRelationship

Real right
type: Concept
preferred label: Ejendomsret @da
preferred label: Ayni hak @tr
preferred label: Hak mutlak @ms
preferred label: - @nl
scope note: EULIS / ELRA term
definition: Prerogative that can be opposed to all, conferring a direct or indirect access to property. (Source: Dualjuridik). A right relating to land that is binding on third parties even if they are unaware of it. (ius in rem) (Source: EULIS / ELRA glossary)
change note: Established with version 1. Term changed and definitions added with version 3.
in scheme: CaLAThe 7.0
alternative label: Interest in land
alternative label: Estate
broader: Land law
narrower: Ownership
narrower: Leasehold
narrower: Encumbrance
narrower: LA_Right

Reallotment
type: Concept
preferred label: Arealoverførsel @da
preferred label: Dağıtım, Tahsis @tr
preferred label: Pembahagian semula @ms
preferred label: Herverkaveling @nl
definition: Reallocation of Real rights into new Real properties through Property formation procedures.
in scheme: CaLAThe 7.0
broader: Land consolidation
broader: Land readjustment
broader: Transfer of part of property
narrow match: WettelijkeHerverkaveling

Registrar
type: Concept
preferred label: Registrator @da
preferred label: Tapu sicil muhafızı @tr
preferred label: Pendaftar @ms
preferred label: Secretaris @nl
definition: An Official role for keeping a Registry or official records.
change note: Established with version 1. Definition is added with version 6.
in scheme: CaLAThe 7.0
broader: Official role

Registry
type: Concept
preferred label: Registerforvaltning @da
preferred label: Sicil @tr
preferred label: Daftar @ms
preferred label: Register @nl
scope note: Public administration
definition: 1. Official records of people or things relating to a business or other activity 2. Organization or place that keeps official records (Source: Adopted from Cambridge Dictionary, Business English)
change note: Added in version 5. Relationships were edited with version 6.
in scheme: CaLAThe 7.0
broader: Governmental organisation
narrower: Cadastre
narrower: Land registry

Rent
type: Concept
preferred label: Leje @da
preferred label: Kira @tr
preferred label: Sewa @ms
preferred label: Huur @nl
definition: A periodic sum paid under a Lease agreement in return for the use of Real property.
change note: Established with version 2.
in scheme: CaLAThe 7.0
broader: Exchange

Representation
type: Concept
preferred label: Repræsentation @da
preferred label: Temsiliyet @tr
preferred label: Perwakilan @ms
preferred label: Representatie @nl
scope note: GEMET term
definition: Any conduct or action undertaken on behalf of a person, group, business or government, often as an elected or appointed voice (Source: Random House, 1997).
change note: Established with version 1.
in scheme: CaLAThe 7.0
broader: Rights holder

Restriction deed
type: Concept
preferred label: Servitutdokument @da
preferred label: İrtifak sözleşmesi @tr
preferred label: Peraturan surat ikatan @ms
preferred label: Akte van vestiging Erfdiensbaarheid @nl
change note: Established with version 1.
in scheme: CaLAThe 7.0
related match: Erfdienstbaarheid
broader: Deed

Right of superficies
type: Concept
preferred label: Superficiærfæste @da
preferred label: Üst hakkı @tr
preferred label: Hak ke atas superfisi @ms
preferred label: - @nl
scope note: OGC LandInfra / InfraGML term
definition: Real property right which enables its proprietor - the âsuperficiaryâ - to have or acquire for himself buildings, constructions or plants (vegetation) in, on or above an immovable thing owned by someone else (Dutch Civil Code Article 5:101; http://www.dutchcivillaw.com/legislation/dcctitle5588.htm)
change note: Established with version 3. Definition is added in version 5.
in scheme: CaLAThe 7.0
alternative label: Building lease
broader: Co-ownership
related: Superficie object

Right of way
type: Concept
preferred label: Vejret @da
preferred label: Geçit hakkı @tr
preferred label: Hak lalu lalang @ms
preferred label: - @nl
definition: Right to circulate given to the holder of the ownership of dominant land (Source: Legal Dictionary of Property in Canada - Dualjuridik).
change note: Established with version 1. Definition added with ver. 3.
in scheme: CaLAThe 7.0
broader: Private law restriction
broader: Public law restriction

Rights holder
type: Concept
preferred label: Rettighedshaver @da
preferred label: Hak sahibi @tr
preferred label: Pemegang hak @ms
preferred label: - @nl
definition: A Party that holds rights related to Real property.
change note: Established with version 2. Alternative relation with version 3. Changed from Rightholder to Rights holder in version 5. Definition is added with version 6.
in scheme: CaLAThe 7.0
alternative label: Holder
broader: Party role type
narrower: Owner
narrower: Mortgagee
narrower: Representation
narrower: Party member
narrower: Legal person
narrower: Mortgagor
narrower: Lessor
narrower: Lessee
narrower: Good faith
related: Document

Road network
type: Concept
preferred label: Vejnet @da
preferred label: Yol ağı @tr
preferred label: Rangkaian jalan raya @ms
preferred label: Wegennetwerk @nl
scope note: GEMET INSPIRE theme
definition: Transportation infrastructure, modelled as a spatial network (Adopted from Barthelemy, 2010: Spatial Networks)
change note: Established with version 4. Definition added with version 6.
in scheme: CaLAThe 7.0
broader: Spatial network
narrower: Postal address

Satellite image
type: Concept
preferred label: Satellitbillede @da
preferred label: Uydu görüntüsü @tr
preferred label: Imej satelit @ms
preferred label: Satellietropname @nl
scope note: GEMET term
definition: A pictorial representation of data projected onto a two-dimensional grid of individual picture elements (pixels) and acquired from a human-made vessel placed in orbit round a planet, moon or star (Source: GEMET).
change note: Established with version 1.
in scheme: CaLAThe 7.0
broader: Digital imagery

Security interest
type: Concept
preferred label: Sikkerhedsret @da
preferred label: Rehin hakkı @tr
preferred label: Kepentingan keselamatan @ms
preferred label: - @nl
change note: Established with version 3.
in scheme: CaLAThe 7.0
broader: Encumbrance
narrower: Mortgage

Seller
type: Concept
preferred label: Sælger @da
preferred label: Satıcı @tr
preferred label: Penjual @ms
preferred label: - @nl
scope note: OGC LandInfra / InfraGML term
change note: Established with version 4
in scheme: CaLAThe 7.0
broader: Signatory

Servient property unit
type: Concept
preferred label: Tjenende ejendom @da
preferred label: Yükümlü taşınmaz @tr
preferred label: Unit harta yang menanggung @ms
preferred label: - @nl
definition: Land (Property unit) submitted to a servitude to benefit a dominant land (Source: Legal Dictionary of Property in Canada - Dualjuridik).
change note: Established with version 1. Definition and alt. relation added with version 3.
in scheme: CaLAThe 7.0
alternative label: Servient land
broader: Easement

Signatory
type: Concept
preferred label: Underskriver @da
preferred label: İmza sahibi @tr
preferred label: Penandatangan @ms
preferred label: - @nl
scope note: OGC LandInfra / InfraGML term
definition: A Natural person who signs a Document.
change note: Added with version 3. Context modified in version 5, with introduction of Legal personality. Definition is changed with version 6.
in scheme: CaLAThe 7.0
alternative label: LI_SigningRole
broader: Legal personality
narrower: Buyer
narrower: Seller
narrower: Owner

Site
type: Concept
preferred label: Lokalitet @da
preferred label: Şantiye @tr
preferred label: Tapak @ms
preferred label: Bouwplaats @nl
scope note: OGC LandInfra / InfraGML term
definition: The area of land or water where construction work or other development is undertaken [ISO 6707-1:2014] (OGC LandInfra, 4.2.9).
change note: Established with version 3.
in scheme: CaLAThe 7.0
broader: Administrative unit

Social group
type: Concept
preferred label: Samfundsgruppe @da
preferred label: Sosyal grup @tr
preferred label: Kumpulan sosial @ms
preferred label: Sociale groep @nl
scope note: GEMET term
definition: A number of Natural persons who interact with one another according to certain societal norms and share certain feeling of unity.
change note: Established with version 1. Definition is changed with version 6.
in scheme: CaLAThe 7.0
broader: Group party
narrower: Family
narrower: Tribe
related: Association

Societal role
type: Concept
preferred label: Rolle i samfundet @da
preferred label: Toplumsal rol @tr
preferred label: Peranan masyarakat @ms
preferred label: Maatschappelijke rol @nl
definition: A Natural person role gained and performed according to social norms.
change note: Established with version 2. Farmer and Neighbor added to narrower with version 5. Definition is added with version 6.
in scheme: CaLAThe 7.0
broader: Natural person role
narrower: Chief
narrower: Farmer
narrower: Neighbor

Spatial data infrastructure
type: Concept
preferred label: Geografisk infrastruktur @da
preferred label: Coğrafi veri altyapısı @tr
preferred label: Infrastruktur data spatial @ms
preferred label: Ruimtelijke data-infrastructuur @nl
scope note: Joinup, EU Commission (https://joinup.ec.europa.eu/collection/elise-european-location-interoperability-solutions-e-government/glossary/term/spatial-data-infrastructure)
definition: A framework of policies, institutional arrangements, technologies, data, and people that enable the effective sharing and use of geographic information
change note: Established with version 1. Definition added with version 6.
in scheme: CaLAThe 7.0
broader: Geolocated information
narrower: Geographic information system
narrower: Gazetteer

Spatial feature type
type: Concept
preferred label: Geografiske objekter @da
preferred label: Coğrafi detay @tr
preferred label: Jenis fitur spatial @ms
preferred label: Type ruimtelijk kenmerk @nl
definition: Classification of spatial objects.
change note: Established with version 1. Edited with version 4.
in scheme: CaLAThe 7.0
broad match: https://isotc211.geolexica.org/concepts/1296/
broader: Land
narrower: Land division
narrower: Topographical feature

Spatial network
type: Concept
preferred label: Geometrisk netværk @da
preferred label: Konumsal ağ @tr
preferred label: Rangkaian spatial @ms
preferred label: - @nl
definition: A Spatial network is a graph, where the topological primitive: node represents a location, while the topological primitive: edge represents the adjacency relationship between locations. A Spatial network is thus constrained by some geometry and embedded in a two- or three-dimensional space (cf. Ulrich, Nourbakhsh, 2000; Barthelemy, 2011)
change note: Introduced with version 4. Changed term to Spatial network with version 6. Edited definition.
in scheme: CaLAThe 7.0
broader: Geolocated information
narrower: Road network

Spatial reference
type: Concept
preferred label: Rumlig reference @da
preferred label: Coğrafi referans @tr
preferred label: Rujukan spatial @ms
preferred label: - @nl
scope note: Geolexica and INSPIRE term
definition: Description of position in the real world. Note to entry: This may take the form of a label, code or coordinate tuple. (Geolexica ISO 19111:2019)
change note: Established with version 1. Edited with version 4 to comply with Geolexica
in scheme: CaLAThe 7.0
broader: Information
narrower: Ordinal scale
narrower: Geographical grid system
narrower: Coordinate reference system

Spatial unit
type: Concept
preferred label: Rumlig enhed @da
preferred label: Konumsal birim @tr
preferred label: Unit spatial @ms
preferred label: - @nl
scope note: ISO LADM and OGC LandInfra / InfraGML term
definition: Contiguous geometrical entity, which is delimited and located on or close to the surface of the Earth through the bounding elements of its boundary. Compares to ISO 19152:2012 4.1.23 spatial unit (Source: OGC LandInfra, 4.8.14).
change note: Established with version 1.0. Replaced by SpatialType with version 3. Narrower of Geolocated information with version 4
in scheme: CaLAThe 7.0
alternative label: LA_SpatialUnit
broader: Geolocated information
narrower: Textlabel type
narrower: Geometric primitive
narrower: Bounding element
narrower: Dimension type
narrower: Topological primitive

Sporadic registration
type: Concept
preferred label: - @da
preferred label: Sistematik olmayan tescil @tr
definition: Registration of a parcel separately from others in the area, voluntarily and generally at the initiative and expense of the owner (Source: Bruce, 1998).
change note: Added with version 7.
in scheme: CaLAThe 7.0

Stakeout
type: Concept
preferred label: Afsætning @da
preferred label: Aplikasyon @tr
preferred label: Pemancangan @ms
preferred label: - @nl
scope note: OGC LandInfra / InfraGML term
definition: The transfer of the point geometry of a construction to the site
change note: Established with version 4. Relationships changed with version 7.
in scheme: CaLAThe 7.0
broad match: http://docs.opengeospatial.org/is/15-111r1/15-111r1.html#162
broader: Survey purpose

Stakeout observation
type: Concept
preferred label: Afsætningskontrolmåling @da
preferred label: Aplikasyon gözlemi @tr
preferred label: - @ms
definition: Stakeout results contains the differences between the design and the resulted TargetPoint. The design point geometry is hold in the DesignPoint (OGC LandInfra 7.8.7.4)
change note: Added with version 7.
in scheme: CaLAThe 7.0
broader: Survey purpose

Street sign
type: Concept
preferred label: Gadeskilt @da
preferred label: Sokak adı tabelası @tr
preferred label: Tanda jalan @ms
preferred label: Straatnamenbord @nl
definition: A sign that designates a street and is placed at intersections during a street addressing project (Source: Farvacque-Vitkovic et al, 2005)
change note: Established with version 1. Edited with version 4.
in scheme: CaLAThe 7.0
alternative label: Plate
broader: Marker
broader: Postal address

String direction
type: Concept
preferred label: - @da
scope note: OGC LandInfra / InfraGML term
definition: For exterior boundary elements, the direction shall be counterclockwise (anti-clockwise) and for interior boundary elements (holes), the direction shall be clockwise. (OGC LandInfra 7.10.7)
in scheme: CaLAThe 7.0
broader: BEString

String type
type: Concept
preferred label: - @da
change note: Established with version 4
in scheme: CaLAThe 7.0
broader: BEString
narrower: Line string

Subdivision
type: Concept
preferred label: Udstykning @da
preferred label: Ayırma @tr
preferred label: Pecah bahagian @ms
preferred label: - @nl
definition: Property formation where a Cadastral parcel is divided into smaller Cadastral parcels.
change note: Established with version 2.
in scheme: CaLAThe 7.0
broader: Property formation
narrower: Condominium subdivision
narrower: Boundary survey and marking

Sublease
type: Concept
preferred label: Fremleje @da
preferred label: Devren kiralama @tr
preferred label: Subpajakan @ms
preferred label: Onderhuur @nl
definition: A lease granted by a lessee.
in scheme: CaLAThe 7.0
broader: Leasehold

Superficie object
type: Concept
preferred label: Bygning på fremmed grund mv @da
preferred label: Üst hakkı nesnesi @tr
preferred label: Objek superfisi @ms
preferred label: - @nl
scope note: OGC LandInfra / InfraGML term
definition: A SuperficieObject comprises a building or other construction, including pipes, cables or tunnels, established and owned by a party (other than the owner of the LandParcels on which the superficie object is constructed) according to a granting Statement. (Source: OGC LandInfra 7.10.2.6, referring to http://www.dutchcivillaw.com/content/dutchcivillaw022.htm).
change note: Established with version 3.
in scheme: CaLAThe 7.0
alternative label: 3D object
broader: Construction
broader: Real property
related: Carrier parcel
related: Right of superficies

Superficie object establishment
type: Concept
preferred label: - @da
preferred label: Üst hakkı tesisi @tr
preferred label: Penubuhan objek superfisi @ms
scope note: OGC LandInfra / InfraGML term
definition: Determination of objects (e.g. Construction) to be subject to the Right of superficies.
change note: Established with version 3.
in scheme: CaLAThe 7.0
alternative label: 3D object identification
broader: Property formation

Superficie object scheme
type: Concept
preferred label: Dokument om superficieobjekt @da
preferred label: Üst hakkı sözleşmesi @tr
preferred label: Skim objek superfisi @ms
preferred label: - @nl
scope note: OGC LandInfra / InfraGML term
change note: Established with version 3.
in scheme: CaLAThe 7.0
alternative label: 3D object scheme
broader: Document

Surface
type: Concept
preferred label: Overflade @da
preferred label: Yüzey @tr
preferred label: Permukaan @ms
preferred label: Vlak @nl
scope note: Geolexica term
definition: 2-dimensional geometric primitive, locally representing a continuous image of a region of a plane. Note to entry: The boundary of a surface is the set of oriented, closed curves that delineate the limits of the surface. Surfaces that are isomorphic to a sphere, or to an n-torus (a topological sphere with n"handles") have no boundary. Such surfaces are called cycles. (Geolexica, ISO 19136-1:2020)
change note: Established with version 4.
in scheme: CaLAThe 7.0
broader: Geometric primitive
narrower: Polygon

Survey
type: Concept
preferred label: Opmåling, Landmåling @da
preferred label: Ölçme @tr
preferred label: Ukur @ms
preferred label: Opmeting @nl
scope note: OGC LandInfra / InfraGML term
definition: Method, algorithm or instrument, or system of these, which may be used in making an observation (Source: ISO 19156:2011, 4.12)
change note: Established with version 4. Cadastral survey added as narrower with version 7.
in scheme: CaLAThe 7.0
narrower: Surveying instrument
narrower: Survey result
narrower: Survey purpose
narrower: Survey point

Survey mark
type: Concept
preferred label: Afmærket punkt @da
preferred label: Ölçü noktası @tr
preferred label: Tanda ukur @ms
preferred label: Grondslagpunt @nl
scope note: OGC LandInfra / InfraGML term
definition: Physical object which by its form defines a point on the surface of the Earth (Source: OGC LandInfra, 4.1.22).
change note: Established with version 3.
in scheme: CaLAThe 7.0
related match: Grondslagelement
broader: Marker
narrower: Boundary mark
narrower: Control point monument
narrower: Trigonometric mark

Survey monument establishment
type: Concept
preferred label: Afmælig;rkning af skel @da
preferred label: Ölçü noktası tesisi @tr
preferred label: Penubuhan monumen ukur @ms
preferred label: Vaststellen referentiepunt @nl
scope note: OGC LandInfra / InfraGML term
definition: An Activity to mark survey points on the Earthâs surface.
change note: Established with version 3.
in scheme: CaLAThe 7.0
broader: Boundary survey and marking

Survey point
type: Concept
preferred label: Opmålingspunkt @da
preferred label: Ölçü noktası @tr
preferred label: Titik pengukuran @ms
preferred label: - @nl
definition: Point to be surveyed
change note: Established with version 7.
in scheme: CaLAThe 7.0
broader: Survey
narrower: Instrument point
narrower: Target point
narrower: Design point

Survey purpose
type: Concept
preferred label: Opmålingsformål @da
preferred label: Ölçme amacı @tr
preferred label: - @ms
change note: Added with version 7.
in scheme: CaLAThe 7.0
broader: Survey
narrower: Cadastral survey
narrower: Topographic survey
narrower: Stakeout
narrower: Stakeout observation

Survey result
type: Concept
preferred label: Opmålingsresultat @da
preferred label: Ölçü sonucu @tr
preferred label: Keputusan, Hasil pengukuran @ms
preferred label: - @nl
scope note: OGC LandInfra / InfraGML term
definition: Estimation of geolocating information of a feature of interest through a survey procedure (Cf. OGC LandInfra 7.1; also see ISO 19156:2011, 4.14).
change note: Established with version 4. Definition edited with version 7.
in scheme: CaLAThe 7.0
broader: Survey
narrower: Observation
narrower: Point cloud
narrower: Image

Surveying instrument
type: Concept
preferred label: Opmålingsinstrument @da
preferred label: Ölçme aleti @tr
preferred label: Alat pengukuran @ms
preferred label: Instrument voor landmeting @nl
definition: The hardware that is used to collect measurements (Cf. OGC Landinfra, 7.8.5.3 Survey sensor)
change note: Established with version 4. Definition added with version 7.
in scheme: CaLAThe 7.0
broader: Survey
narrower: Camera
narrower: Compass
narrower: LI_Sensor
narrower: Measuring tape
narrower: Electronic distance meter
narrower: Theodolite
narrower: GNSS sensor
narrower: Terrestrial Laser Scanner
narrower: Total station

Surveyor
type: Concept
preferred label: Landinspektør med beskikkelse @da
preferred label: Haritacı @tr
preferred label: Juruukur @ms
preferred label: Landmeter @nl
definition: A Professional with the academic qualifications and technical expertise to practise the science of measurement; to assemble and assess land and geographic related information; to use that information for the purpose of planning and implementing the efficient administration of the land, the sea and structures thereon; and to instigate the advancement and development of such practices (FIG, https://www.fig.net/about/general/definition/definition.pdf)
change note: Established with version 1. Definition is added with version 6.
in scheme: CaLAThe 7.0
broader: Professional
narrower: Licensed surveyor
narrower: LI_LandSurveyor
narrower: LA_CertifiedSurveyor

Target point
type: Concept
preferred label: Opmålt detailpunkt, cf. lex.dk/detailmåling @da
preferred label: Detay (alım) noktası @tr
preferred label: Titik sasaran @ms
preferred label: Richtpunt @nl
scope note: OGC LandInfra / InfraGML term
definition: TargetPoint is the value of a geometry of the feature of interest that has been estimated from the raw observations (OGC LandInfra 7.8.7.2)
change note: Established with version 4. Relationships changed with version 7.
in scheme: CaLAThe 7.0
broader: Survey point
narrower: Boundary point
narrower: Control point
narrower: Terrain point

Terrain point
type: Concept
preferred label: Punktformet terrængenstand, bygningshjørne el. lign. @da
preferred label: Yeryüzündeki nokta (bina köşesi vb.) @tr
preferred label: Titik sasaran @ms
preferred label: - @nl
definition: Point of LandElement (cf. OGC LandInfra 7.9.2), e.g the corner of a building. Including well-defined terrain points in cadastral surveys raises the potential for re-establishing property boundaries.
change note: Established with version 7.
in scheme: CaLAThe 7.0
broader: Target point

Terrestrial Laser Scanner
type: Concept
preferred label: Terrestisk laserscanner @da
preferred label: Yersel lazer tarayıcı @tr
preferred label: Pengimbas laser terestrial @ms
preferred label: Terrestrischee laserscanner @nl
scope note: OGC LandInfra / InfraGML term
definition: Terrestrial LaserScanner sensors are used to measure point clouds with the controlled steering of laser beams followed by a distance measurement at every pointing direction. (OGC LandInfra 7.8.5.12)
change note: Established with version 4
in scheme: CaLAThe 7.0
alternative label: Laser scanner
broader: Surveying instrument
narrower: Point cloud

Textlabel type
type: Concept
preferred label: - @da
preferred label: Type tekstlabel @nl
scope note: OGC Land and Infrastructure Conceptual Model Standard (LandInfra) 15-111r1
definition: The BoundingElement is described with text instead of having a geometric representation (LandInfra 7.10.7)
change note: Established with version 1. Definition added, and Broader changed to Bounding element with ver 6
in scheme: CaLAThe 7.0
broader: Bounding element

Theodolite
type: Concept
preferred label: Teodolit @da
preferred label: Theodoliet @nl
scope note: OGC LandInfra / InfraGML term
definition: Instrument for measuring horizontal directions or horizontal directions and vertical angles, whose main components are the horizontal circle and the vertical circle, the telescope and additional devices for reading the graduated circles and for setting up the vertical axis (OGC LandInfra 4.6.18, referring to ISO 9849-1:2000)
change note: Established with version 4
in scheme: CaLAThe 7.0
broader: Surveying instrument
narrower: Angle observation

Timeshare right
type: Concept
preferred label: Timeshare rettighed @da
preferred label: Devre mülk hakkı @tr
preferred label: Hak bersama @ms
preferred label: - @nl
change note: Established with v1.
in scheme: CaLAThe 7.0
broader: Co-ownership

Title
type: Concept
preferred label: Adkomst @da
preferred label: Tapu @tr
preferred label: Hakmilik @ms
preferred label: Titel @nl
scope note: EULIS / ELRA term
definition: A Document that evidences a personâs Ownership of Real property, or âentitlementâ (Source: Adopted from FAO, 2002).
change note: Established with version 3. Definition is added with version 6. Definition changed with version 7.
in scheme: CaLAThe 7.0
broader: Owner

Title deed
type: Concept
preferred label: Skøde @da
preferred label: Tapu senedi @tr
preferred label: Surat lkatan hakmilik @ms
preferred label: De titel van aankomst @nl
change note: Established with version 1.
in scheme: CaLAThe 7.0
broader: Deed

Topographic map
type: Concept
preferred label: Topografisk kort @da
preferred label: Topoğrafik harita @tr
preferred label: Peta topografi @ms
preferred label: Topografische kaart @nl
definition: A large-scale map, conveying the shape and pattern of a landscape (Cf. Harvey, 1980)
change note: Established with version 2.0. Definition added with version 6.
in scheme: CaLAThe 7.0
broader: Map

Topographic survey
type: Concept
preferred label: Topografisk opmåling @da
preferred label: Topoğrafik ölçme @tr
preferred label: Ukur topografik @ms
preferred label: - @nl
definition: Survey of topographical features of the land (Cf. OGC LandInfra 7.9.2 Land Element)
change note: Added with version 7.
in scheme: CaLAThe 7.0
broader: Survey purpose

Topographical feature
type: Concept
preferred label: Topografisk objekt @da
preferred label: Topoğrafik detay @tr
preferred label: Fitur topografi @ms
preferred label: Topografisch kenmerk @nl
definition: Spatial feature the boundary of which is a plain attribute. Land and objects described from a physical (non-administrative) perspective.
change note: Established with version 1. Definition added in version 5. Definition extended in version 7.
in scheme: CaLAThe 7.0
broader: Spatial feature type
narrower: Hydrography
narrower: Elevation
narrower: Transport network
narrower: Construction

Topological primitive
type: Concept
preferred label: Topologisk objekt @da
preferred label: Topolojik obje @tr
preferred label: Topologisch primitief @nl
preferred label: Topologi primitif @ms
scope note: ISO/PDTS 19104 term
definition: A topological object that represents a single, non-decomposable element. (Source: ISO 19104:2016).
change note: Established with version 1.
in scheme: CaLAThe 7.0
broader: Spatial unit
narrower: Node
narrower: Edge
narrower: Face

Total station
type: Concept
preferred label: Totalstation @da
scope note: OGC LandInfra / InfraGML term
definition: Tps (totalstation) is an electronic theodolite integrated with an electronic distance meter (EDM). Modern totalstations may also contain one or more cameras. (Source: OGC LandInfra 7.8.5.10)
change note: Established with version 4. Definition added with version 7.
in scheme: CaLAThe 7.0
broader: Surveying instrument
narrower: TPSobservation

TPSobservation
type: Concept
preferred label: Vinkel- og afstandsmåling @da
preferred label: Açı ve mesafe ölçümü @tr
preferred label: - @nl
scope note: OGC LandInfra / InfraGML term
definition: A TPSObservation contains angular and distance observation from the InstrumentPoint to the TargetPoint. Additional sensor information as inclination observations may be also included. (Source: OGC LandInfra 7.8.3.7)
change note: Established with version 4. Definition added with version 7.
in scheme: CaLAThe 7.0
broader: Total station
broader: Observation

Transfer
type: Concept
preferred label: Overdragelse @da
preferred label: İntikal @tr
preferred label: Overdracht @nl
preferred label: Pindah milik @ms
definition: The disposal of Real property or Real rights without any payment.
change note: Established with version 2.
narrow match: OverdrachtDoorFusieOfSplitsingRechtspersoon
narrow match: OverdrachtDoorVeilingOfOpenbareVerkoop
narrow match: OverdrachtDoorVernieuwing
narrow match: OverdrachtDoorVoorwaardeVervulling
related match: OverdrachtHypotheekrecht
in scheme: CaLAThe 7.0
broader: Activity
narrower: Gift
narrower: Inheritance
narrower: Partition
narrower: Prescriptive acquisition

Transfer of part of property
type: Concept
preferred label: Arealoverførsel @da
preferred label: İfrazen devir @tr
preferred label: Pindah milik sebahagian harta @ms
preferred label: - @nl
definition: Exchange of Property rights to a Real property part in the context of Property formation.
change note: Established with version 2.0.
in scheme: CaLAThe 7.0
broader: Property formation
narrower: Reallotment

Transport network
type: Concept
preferred label: Transportnet @da
preferred label: Ulaşım ağı @tr
preferred label: Rangkaian pengangkutan @ms
preferred label: Transport netwerk @nl
scope note: INSPIRE theme
definition: Road, rail, air and water transport networks and related infrastructure. Includes links between different networks. Also includes the trans-European transport network as defined in Decision No 1692/96/EC of the European Parliament and of the Council of 23 July 1996 on Community Guidelines for the development of the trans-European transport network (1) and future revisions of that Decision (Source: INSPIRE theme register).
change note: Established with version 1.
in scheme: CaLAThe 7.0
broader: Topographical feature

Tribe
type: Concept
preferred label: Stamme @da
preferred label: Aşiret @tr
preferred label: Suku kaum @ms
preferred label: Stam @nl
definition: A Social group composed of numerous families, clans, or generations having shared ancestry, language and customs.
change note: Established with version 1. Definition is added with version 6.
in scheme: CaLAThe 7.0
broader: Social group

Trigonometric mark
type: Concept
preferred label: Trigonometrisk postament @da
preferred label: Trigonometrik ölçü noktası @tr
preferred label: Tanda trigonometri @ms
preferred label: Trigonometrische markering @nl
scope note: OGC LandInfra / InfraGML term
definition: Marks an observation point of geodetic significance (Source: OGC LandInfra, 7.10.5.1)
change note: Established with version 3.
in scheme: CaLAThe 7.0
broader: Survey mark

User defined value
type: Concept
preferred label: Brugerdefineret værdi @da
preferred label: Özel değer @tr
preferred label: Nilai takrifan pengguna @ms
preferred label: Door de gebruiker gedefineerde waarde @nl
in scheme: CaLAThe 7.0
broader: Code list

Usufruct
type: Concept
preferred label: Brugsret @da
preferred label: Yararlanma (intifa) hakkı @tr
preferred label: Usufruk @ms
preferred label: - @nl
scope note: EULIS / ELRA term
definition: Temporary right to use and enjoy the benefit and gain of the property of another, without changing the character of the property. (Source: EULIS / ELRA glossary)
in scheme: CaLAThe 7.0
broader: Encumbrance